{"text_format":"1","workbook":"xlsx","n_sheets":3,"sheets":["MENUS","Outils","Allergènes du jour"],"not_rendered":{"charts":0,"images":15,"macros":1,"external_links":0,"defined_names":3,"comments":0,"pivot_tables":0},"unopened":[],"bounds":{"document_bytes":16777216,"sheet_cells":100000,"rows_first":2000,"rows_last":500,"rows_between":2000,"halvings":0,"cell_chars":16384,"cell_head_chars":4096},"cells_cut":0,"cells_raw":0,"read":"whole","date_system":"1900"}

{"sheet":"MENUS","index":0,"n_rows":60,"n_cols":10,"rows_kept":60,"cut":false,"hidden":false,"merged":[[2,7,2,8],[0,0,0,8],[1,0,1,8]]}
["Menus "]
["Mai Juin 2023"]
["2023-05-08"]
["JOUR","SEMAINE 19","SEMAINE 20","SEMAINE 21","SEMAINE 22","SEMAINE 23","SEMAINE 24","SEMAINE 25","SEMAINE 26","SEMAINE 27"]
["SEMAINE","DU 8 AU 12 MAI 2023","DU 15 AU 19 MAI 2023","DU 22 AU 26 MAI 2023","DU 29 MAI AU 2 JUIN 2023","DU 5 AU 9 JUIN 2023","DU 12 AU 16 JUIN 2023","DU 19 AU 23 JUIN 2023","DU 26 AU 30 JUIN 2023","DU 3 AU 7 JUILLET 2023"]
[null,null,null,"REPAS VEGETARIEN",null,"REPAS VEGETARIEN",null,null,null,"REPAS VEGETARIEN"]
[null,null,"","Salade de céleri BIO persillée",null,"Salade de boulgour","Salade californienne (Haricots rouges, maïs, poivrons, ananas)","","","Salade de carottes BIO"]
[]
[null,null,"Palette au jus","Falafels végétales au jus",null,"Omelette BIO aux fines herbes","Filet de lieu sauce blanche","Filet de porc sauce dijonnaise","Emincé de volaille sauce tomate","Crispy d'or au fromage"]
["LUNDI",null,"Lentilles aux dés de carottes","Semoule et ratatouille",null,"Gratin de chou-fleur","Riz et haricots verts","Pommes de terre sautées","Penne","Purée pommes de terre courgettes"]
[null,null,"Saint Paulin BIO","",null,"","","Brie BIO à la coupe","Fromage blanc sucré",""]
[]
[null,null,"Yaourt aux fruits","Fruit de saison",null,"Crème dessert chocolat","Fruit de saison BIO","Clafoutis à la cerise","Fruit de saison BIO","Fruit de saison"]
[]
[null,null,"Rôti de volaille au jus",null,null,null,null,"Filet de volaille sauce dijonnaise"]
[null,null,"Dhal de lentilles aux carottes et boulgour",null,null,null,"Palets de légumes montagnards, sauce blanche","Palet végétal sauce dijonnaise","Emincé végétal, sauce tomate"]
[null,null,"REPAS STREET FOOD",null,"REPAS VEGETARIEN",null,"REPAS VEGETARIEN",null,null,"MENU DES ENFANTS"]
[null,"Salade de chou rouge","","Salade de radis BIO","","","Salade verte","Crudités","Salade de riz composée"]
[]
[null,"Cassolette de colin d'Alaska","Emincé de poulet grillé aux épices, sauce blanche","Nuggets de poisson sauce tartare","Galette végétale légumes et mozzarella","Cassolette de poisson basquaise","Tortellinis tomates mozarella BIO sauce basilic","Sauté de bœuf sauce charcutière","Steack haché sauce brune"]
["MARDI","Riz BIO","Pomme de terre","Petits pois carottes","Courgettes BIO sauce tomate","Riz BIO",null,"Haricots plats et boulgour","Printannière de légumes"]
[null,"","Emmental à la coupe","","Cantadou","Coulommiers à la coupe","","",""]
[]
[null,"Compote pomme","Yaourt nature sucré bio","Yaourt aromatisé","Fondant au chocolat","Fruit de saison","Fruit de saison","Fruit de saison BIO","Compote de fruits BIO"]
[]
[]
[null,"Boulette de lentilles en sauce","Emincé végétal, sauce blanche","Nuggets végétariennes sauce tartare",null,"Quennelles basquaise",null,"Œufs brouillés aux herbes","Crêpe aux champignons"]
[null,null,"REPAS VEGETARIEN"]
[null,"","","","","Salade de radis","","Salade de carottes BIO","","Salade de tomates"]
[]
[null,"Cordon bleu de volaille ketchup","Parmentier végétarien BIO","Sauté de volaille au pesto","Pépites de colin aux 3 céréales, sauce rémoulade","Rôti de bœuf à l'échalote","Emincé de poulet à la crème","Emincé de volaille à l'ancienne","Plein filet de hoki doré au beurre","Carbonnade de bœuf"]
["MERCREDI","Pommes rissolées","à l'égréné végétal","Fusilli","Epinards à la crème","Purée pommes de terre, carottes BIO","Purée pommes de terre","Coquillettes et courgettes sautées au thym","Boulgour et épinards","Petits pois BIO aux petits oignons"]
[null,"Camembert à la coupe BIO","Coulommier à la coupe","Brie","Camembert","","Camembert","","Fromage BIO",""]
[]
[null,"Yaourt aux fruits","Crème dessert chocolat","Compote de fruit BIO","Fruit de saison BIO","Fruit de saison","Yaourt nature sucré BIO","Yaourt aux fruits","Yaourt aux fruits","Fruit"]
[]
[]
[null,"Croustillant au fromage ketchup",null,"Tortellinis ricotta épinards","Beignet de légumes, sauce rémoulade","Boulette de lentilles en sauce","Emincé végétal à la crème","Quenelles sauce végétarienne","Quenelles natures BIO","Omelette au fromage"]
[null,"REPAS VEGETARIEN",null,null,null,null,null,null,"REPAS VEGETARIEN"]
[null,"Salade de concombre bio",null,"Salade de carottes BIO","Salade de céleri BIO","","","","Salade de courgettes râpées BIO","Salade de céleri BIO"]
[]
[null,"Pâtes complètes à la sicilienne",null,"Emincé de bœuf aux échalotes","Sauté de porc aux pêches","Emincé de volaille façon carbonara","Goulash de bœuf","Colin meunière, citron","Œufs brouilles aux herbes","Filet de colin sauce au curcuma"]
["JEUDI","(tomates, aubergines, basilic) et fromage",null,"Riz et chou de bruxelles","Boulgour et petits légumes aux épices","Pâtes","Semoule et carotte vichy","Purée de céleri BIO","Purée pommes de terre","Semoule et duo de haricots (verts et beurre)"]
[null,"",null,"","","Emmental râpé","Fripon","Bleuet des prairies à la coupe","",""]
[]
[null,"Fruit de saison",null,"Tarte pomme rhubarbe","Flan saveur vanille","Compote de fruit BIO","Compote de fruits BIO","Fruit de saison","Tarte au fromage blanc","Petit suisse sucré"]
[]
[null,null,null,null,"Rôti de volaille aux pêches"]
[null,null,null,"Falafel en sauce","Boulettes de lentilles aux pêches","Pâtes carbonara végétarienne","Boulettes végétariennes","Nuggets de fromage",null,"Beignet de légumes"]
[null,null,null,null,"MENU DES ENFANTS",null,null,"REPAS VEGETARIEN"]
[null,"Salade coleslaw BIO",null,"",null,"","Salade de tomates BIO","Radis rouges émincés vinaigrette","",""]
[]
[null,"Sauté de bœuf sauce brune",null,"Mijoté de veau grand-mère",null,"Jambon braisé et son jus","Fricassé de volaille aux champignons","Lasagnes","Côte cuite de porc","Emincé de volaille à la crème"]
["VENDREDI","Pâtes et haricots verts",null,"Spaetzle",null,"Gratin dauphinois","Farfalles","épinards et chèvre","Riz et carottes BIO au miel","Riz BIO"]
[null,"",null,"Fromage aux fines herbes BIO",null,"Edam BIO à la coupe","","","Emmental","Fromage"]
[]
[null,"Gélifié vanille nappé caramel",null,"Fruit de saison",null,"Crêpe sucrée","Tarte au citron","Fruit de saison BIO","Crème dessert saveur chocolat","Compote"]
[]
[null,null,null,null,null,"Jambon de volaille et son jus",null,null,"Rôti de volaille"]
[null,"Quenelles natures, sauce brune végétarienne",null,"Egréné végétal sauce végétarienne",null,"Gratin dauphinois, petits légumes et fromage","Fricassé de haricots blancs aux petits légumes",null,"Risotto carottes et fèves","Emincé végétal à la crème"]

{"sheet":"Outils","index":1,"n_rows":770,"n_cols":26,"rows_kept":770,"cut":false,"hidden":false,"merged":[]}
["2023-05-08","DU 8 AU 12 MAI 2023","LUNDI",null,"Thème","45054Thème","","","","","","","","","","","","","","","","","","","",""]
["2023-05-08","DU 8 AU 12 MAI 2023","LUNDI",null,"Entrée","45054Entrée","","","","","","","","","","","","","","","","","","","",""]
["2023-05-08","DU 8 AU 12 MAI 2023","LUNDI",null,"Entrée bis","45054Entrée bis","","","","","","","","","","","","","","","","","","","",""]
["2023-05-08","DU 8 AU 12 MAI 2023","LUNDI",null,"Plat","45054Plat","","","","","","","","","","","","","","","","","","","",""]
["2023-05-08","DU 8 AU 12 MAI 2023","LUNDI",null,"Garniture","45054Garniture","","","","","","","","","","","","","","","","","","","",""]
["2023-05-08","DU 8 AU 12 MAI 2023","LUNDI",null,"Fromage ou laitage","45054Fromage ou laitage","","","","","","","","","","","","","","","","","","","",""]
["2023-05-08","DU 8 AU 12 MAI 2023","LUNDI",null,"Fromage ou laitage bis","45054Fromage ou laitage bis","","","","","","","","","","","","","","","","","","","",""]
["2023-05-08","DU 8 AU 12 MAI 2023","LUNDI",null,"Dessert","45054Dessert","","","","","","","","","","","","","","","","","","","",""]
["2023-05-08","DU 8 AU 12 MAI 2023","LUNDI",null,"Dessert bis","45054Dessert bis","","","","","","","","","","","","","","","","","","","",""]
["2023-05-08","DU 8 AU 12 MAI 2023","LUNDI",null,"Alternative sans porc","45054Alternative sans porc","","","","","","","","","","","","","","","","","","","",""]
["2023-05-08","DU 8 AU 12 MAI 2023","LUNDI",null,"Alternative végétarien","45054Alternative végétarien","","","","","","","","","","","","","","","","","","","",""]
["2023-05-09","DU 8 AU 12 MAI 2023","MARDI",null,"Thème","45055Thème","","","","","","","","","","","","","","","","","","","",""]
["2023-05-09","DU 8 AU 12 MAI 2023","MARDI","Salade de chou rouge","Entrée","45055Entrée","Salade de chou rouge","OK","","","","","","","","","x","x","","x","","","Scolaires","Entrée","Crudité",""]
["2023-05-09","DU 8 AU 12 MAI 2023","MARDI",null,"Entrée bis","45055Entrée bis","","","","","","","","","","","","","","","","","","","",""]
["2023-05-09","DU 8 AU 12 MAI 2023","MARDI","Cassolette de colin d'Alaska","Plat","45055Plat","Cassolette de colin d'Alaska","OK","x","x","x","x","","x","x","","x","","","","","x","Scolaires","Plat","Poisson",""]
["2023-05-09","DU 8 AU 12 MAI 2023","MARDI","Riz BIO","Garniture","45055Garniture","Riz BIO","OK","","","","","","","","","","","","","","","Scolaires","Garniture BIO","Féculents",""]
["2023-05-09","DU 8 AU 12 MAI 2023","MARDI","","Fromage ou laitage","45055Fromage ou laitage","","","","","","","","","","","","","","","","","","","",""]
["2023-05-09","DU 8 AU 12 MAI 2023","MARDI",null,"Fromage ou laitage bis","45055Fromage ou laitage bis","","","","","","","","","","","","","","","","","","","",""]
["2023-05-09","DU 8 AU 12 MAI 2023","MARDI","Compote pomme","Dessert","45055Dessert","Compote pomme","OK","","","","","","","","","","","","","","","Scolaires","Dessert","Fruit cru ou cuit",""]
["2023-05-09","DU 8 AU 12 MAI 2023","MARDI",null,"Dessert bis","45055Dessert bis","","","","","","","","","","","","","","","","","","","",""]
["2023-05-09","DU 8 AU 12 MAI 2023","MARDI",null,"Alternative sans porc","45055Alternative sans porc","","","","","","","","","","","","","","","","","","","",""]
["2023-05-09","DU 8 AU 12 MAI 2023","MARDI","Boulette de lentilles en sauce","Alternative végétarien","45055Alternative végétarien","Boulette de lentilles en sauce","OK","x","","x","","","x","x","","x","","","","","","Scolaires","Plat","Végétarien",""]
["2023-05-10","DU 8 AU 12 MAI 2023","MERCREDI",null,"Thème","45056Thème","","","","","","","","","","","","","","","","","","","",""]
["2023-05-10","DU 8 AU 12 MAI 2023","MERCREDI","","Entrée","45056Entrée","","","","","","","","","","","","","","","","","","","",""]
["2023-05-10","DU 8 AU 12 MAI 2023","MERCREDI",null,"Entrée bis","45056Entrée bis","","","","","","","","","","","","","","","","","","","",""]
["2023-05-10","DU 8 AU 12 MAI 2023","MERCREDI","Cordon bleu de volaille ketchup","Plat","45056Plat","Cordon bleu de volaille ketchup","OK","x","","","","","x","x","","","","","","","","Scolaires","Plat","Volaille",""]
["2023-05-10","DU 8 AU 12 MAI 2023","MERCREDI","Pommes rissolées","Garniture","45056Garniture","Pommes rissolées","OK","","","","","","","","","","","","","","","Scolaires","Garniture","Féculents",""]
["2023-05-10","DU 8 AU 12 MAI 2023","MERCREDI","Camembert à la coupe BIO","Fromage ou laitage","45056Fromage ou laitage","Camembert à la coupe BIO","OK","","","","","","","x","","","","","","","","Scolaires","Produits laitiers BIO","Fromage",""]
["2023-05-10","DU 8 AU 12 MAI 2023","MERCREDI",null,"Fromage ou laitage bis","45056Fromage ou laitage bis","","","","","","","","","","","","","","","","","","","",""]
["2023-05-10","DU 8 AU 12 MAI 2023","MERCREDI","Yaourt aux fruits","Dessert","45056Dessert","Yaourt aux fruits","OK","","","","","","","x","","","","","","","","Scolaires","Produits laitiers","Laitage",""]
["2023-05-10","DU 8 AU 12 MAI 2023","MERCREDI",null,"Dessert bis","45056Dessert bis","","","","","","","","","","","","","","","","","","","",""]
["2023-05-10","DU 8 AU 12 MAI 2023","MERCREDI",null,"Alternative sans porc","45056Alternative sans porc","","","","","","","","","","","","","","","","","","","",""]
["2023-05-10","DU 8 AU 12 MAI 2023","MERCREDI","Croustillant au fromage ketchup","Alternative végétarien","45056Alternative végétarien","Croustillant au fromage ketchup","OK","x","","x","","","x","x","","","","","","","","Scolaires","Plat","Végétarien",""]
["2023-05-11","DU 8 AU 12 MAI 2023","JEUDI","REPAS VEGETARIEN","Thème","45057Thème","REPAS VEGETARIEN","","","","","","","","","","","","","","","","","","",""]
["2023-05-11","DU 8 AU 12 MAI 2023","JEUDI","Salade de concombre bio","Entrée","45057Entrée","Salade de concombre bio","OK","","","","","","","","","x","x","","x","","","Scolaires","Entrée BIO","Crudité",""]
["2023-05-11","DU 8 AU 12 MAI 2023","JEUDI",null,"Entrée bis","45057Entrée bis","","","","","","","","","","","","","","","","","","","",""]
["2023-05-11","DU 8 AU 12 MAI 2023","JEUDI","Pâtes complètes à la sicilienne","Plat","45057Plat","Pâtes complètes à la sicilienne","OK","x","","x","","","","","","x","","","","","","","","",""]
["2023-05-11","DU 8 AU 12 MAI 2023","JEUDI","(tomates, aubergines, basilic) et fromage","Garniture","45057Garniture","(tomates, aubergines, basilic) et fromage","OK","","","x","","x","x","x","x","x","","","","","x","Crèche","Garniture BIO","Féculents / Légumes verts",""]
["2023-05-11","DU 8 AU 12 MAI 2023","JEUDI","","Fromage ou laitage","45057Fromage ou laitage","","","","","","","","","","","","","","","","","","","",""]
["2023-05-11","DU 8 AU 12 MAI 2023","JEUDI",null,"Fromage ou laitage bis","45057Fromage ou laitage bis","","","","","","","","","","","","","","","","","","","",""]
["2023-05-11","DU 8 AU 12 MAI 2023","JEUDI","Fruit de saison","Dessert","45057Dessert","Fruit de saison","OK","","","","","","","","","","","","","","","Scolaires","Dessert","Fruit cru ou cuit",""]
["2023-05-11","DU 8 AU 12 MAI 2023","JEUDI",null,"Dessert bis","45057Dessert bis","","","","","","","","","","","","","","","","","","","",""]
["2023-05-11","DU 8 AU 12 MAI 2023","JEUDI",null,"Alternative sans porc","45057Alternative sans porc","","","","","","","","","","","","","","","","","","","",""]
["2023-05-11","DU 8 AU 12 MAI 2023","JEUDI",null,"Alternative végétarien","45057Alternative végétarien","","","","","","","","","","","","","","","","","","","",""]
["2023-05-12","DU 8 AU 12 MAI 2023","VENDREDI",null,"Thème","45058Thème","","","","","","","","","","","","","","","","","","","",""]
["2023-05-12","DU 8 AU 12 MAI 2023","VENDREDI","Salade coleslaw BIO","Entrée","45058Entrée","Salade coleslaw BIO","OK","","","","","","","","","x","x","","x","","","Scolaires","Entrée","Crudité",""]
["2023-05-12","DU 8 AU 12 MAI 2023","VENDREDI",null,"Entrée bis","45058Entrée bis","","","","","","","","","","","","","","","","","","","",""]
["2023-05-12","DU 8 AU 12 MAI 2023","VENDREDI","Sauté de bœuf sauce brune","Plat","45058Plat","Sauté de bœuf sauce brune","OK","x","","x","","","x","x","","x","x","","x","","","Crèche","Plat","Bœuf",""]
["2023-05-12","DU 8 AU 12 MAI 2023","VENDREDI","Pâtes et haricots verts","Garniture","45058Garniture","Pâtes et haricots verts","OK","x","","x","","","","x","","x","","","","","","Scolaires","Garniture","Féculents / Légumes verts",""]
["2023-05-12","DU 8 AU 12 MAI 2023","VENDREDI","","Fromage ou laitage","45058Fromage ou laitage","","","","","","","","","","","","","","","","","","","",""]
["2023-05-12","DU 8 AU 12 MAI 2023","VENDREDI",null,"Fromage ou laitage bis","45058Fromage ou laitage bis","","","","","","","","","","","","","","","","","","","",""]
["2023-05-12","DU 8 AU 12 MAI 2023","VENDREDI","Gélifié vanille nappé caramel","Dessert","45058Dessert","Gélifié vanille nappé caramel","OK","","","","","","","x","","","","","","","","Scolaires","Produits laitiers","Laitage",""]
["2023-05-12","DU 8 AU 12 MAI 2023","VENDREDI",null,"Dessert bis","45058Dessert bis","","","","","","","","","","","","","","","","","","","",""]
["2023-05-12","DU 8 AU 12 MAI 2023","VENDREDI",null,"Alternative sans porc","45058Alternative sans porc","","","","","","","","","","","","","","","","","","","",""]
["2023-05-12","DU 8 AU 12 MAI 2023","VENDREDI","Quenelles natures, sauce brune végétarienne","Alternative végétarien","45058Alternative végétarien","Quenelles natures, sauce brune végétarienne","OK","x","x","x","x","x","x","x","x","x","x","x","x","x","x","","","",""]
["2023-05-13","DU 8 AU 12 MAI 2023","SAMEDI",null,"Thème","45059Thème","","","","","","","","","","","","","","","","","","","",""]
["2023-05-13","DU 8 AU 12 MAI 2023","SAMEDI",null,"Entrée","45059Entrée","","","","","","","","","","","","","","","","","","","",""]
["2023-05-13","DU 8 AU 12 MAI 2023","SAMEDI",null,"Entrée bis","45059Entrée bis","","","","","","","","","","","","","","","","","","","",""]
["2023-05-13","DU 8 AU 12 MAI 2023","SAMEDI",null,"Plat","45059Plat","","","","","","","","","","","","","","","","","","","",""]
["2023-05-13","DU 8 AU 12 MAI 2023","SAMEDI",null,"Garniture","45059Garniture","","","","","","","","","","","","","","","","","","","",""]
["2023-05-13","DU 8 AU 12 MAI 2023","SAMEDI",null,"Fromage ou laitage","45059Fromage ou laitage","","","","","","","","","","","","","","","","","","","",""]
["2023-05-13","DU 8 AU 12 MAI 2023","SAMEDI",null,"Fromage ou laitage bis","45059Fromage ou laitage bis","","","","","","","","","","","","","","","","","","","",""]
["2023-05-13","DU 8 AU 12 MAI 2023","SAMEDI",null,"Dessert","45059Dessert","","","","","","","","","","","","","","","","","","","",""]
["2023-05-13","DU 8 AU 12 MAI 2023","SAMEDI",null,"Dessert bis","45059Dessert bis","","","","","","","","","","","","","","","","","","","",""]
["2023-05-13","DU 8 AU 12 MAI 2023","SAMEDI",null,"Alternative sans porc","45059Alternative sans porc","","","","","","","","","","","","","","","","","","","",""]
["2023-05-13","DU 8 AU 12 MAI 2023","SAMEDI",null,"Alternative végétarien","45059Alternative végétarien","","","","","","","","","","","","","","","","","","","",""]
["2023-05-14","DU 8 AU 12 MAI 2023","DIMANCHE",null,"Thème","45060Thème","","","","","","","","","","","","","","","","","","","",""]
["2023-05-14","DU 8 AU 12 MAI 2023","DIMANCHE",null,"Entrée","45060Entrée","","","","","","","","","","","","","","","","","","","",""]
["2023-05-14","DU 8 AU 12 MAI 2023","DIMANCHE",null,"Entrée bis","45060Entrée bis","","","","","","","","","","","","","","","","","","","",""]
["2023-05-14","DU 8 AU 12 MAI 2023","DIMANCHE",null,"Plat","45060Plat","","","","","","","","","","","","","","","","","","","",""]
["2023-05-14","DU 8 AU 12 MAI 2023","DIMANCHE",null,"Garniture","45060Garniture","","","","","","","","","","","","","","","","","","","",""]
["2023-05-14","DU 8 AU 12 MAI 2023","DIMANCHE",null,"Fromage ou laitage","45060Fromage ou laitage","","","","","","","","","","","","","","","","","","","",""]
["2023-05-14","DU 8 AU 12 MAI 2023","DIMANCHE",null,"Fromage ou laitage bis","45060Fromage ou laitage bis","","","","","","","","","","","","","","","","","","","",""]
["2023-05-14","DU 8 AU 12 MAI 2023","DIMANCHE",null,"Dessert","45060Dessert","","","","","","","","","","","","","","","","","","","",""]
["2023-05-14","DU 8 AU 12 MAI 2023","DIMANCHE",null,"Dessert bis","45060Dessert bis","","","","","","","","","","","","","","","","","","","",""]
["2023-05-14","DU 8 AU 12 MAI 2023","DIMANCHE",null,"Alternative sans porc","45060Alternative sans porc","","","","","","","","","","","","","","","","","","","",""]
["2023-05-14","DU 8 AU 12 MAI 2023","DIMANCHE",null,"Alternative végétarien","45060Alternative végétarien","","","","","","","","","","","","","","","","","","","",""]
["2023-05-15","DU 15 AU 19 MAI 2023","LUNDI",null,"Thème","45061Thème","","","","","","","","","","","","","","","","","","","",""]
["2023-05-15","DU 15 AU 19 MAI 2023","LUNDI","","Entrée","45061Entrée","","","","","","","","","","","","","","","","","","","",""]
["2023-05-15","DU 15 AU 19 MAI 2023","LUNDI",null,"Entrée bis","45061Entrée bis","","","","","","","","","","","","","","","","","","","",""]
["2023-05-15","DU 15 AU 19 MAI 2023","LUNDI","Palette au jus","Plat","45061Plat","Palette au jus","OK","x","","x","","","","x","x","x","x","","x","","","Scolaires","Plat","Porc",""]
["2023-05-15","DU 15 AU 19 MAI 2023","LUNDI","Lentilles aux dés de carottes","Garniture","45061Garniture","Lentilles aux dés de carottes","OK","x","","x","","","","x","","x","","","","","","Scolaires","Garniture","Féculents / Légumes verts",""]
["2023-05-15","DU 15 AU 19 MAI 2023","LUNDI","Saint Paulin BIO","Fromage ou laitage","45061Fromage ou laitage","Saint Paulin BIO","OK","","","","","","","x","","","","","","","","Scolaires","Produits laitiers BIO","Fromage",""]
["2023-05-15","DU 15 AU 19 MAI 2023","LUNDI",null,"Fromage ou laitage bis","45061Fromage ou laitage bis","","","","","","","","","","","","","","","","","","","",""]
["2023-05-15","DU 15 AU 19 MAI 2023","LUNDI","Yaourt aux fruits","Dessert","45061Dessert","Yaourt aux fruits","OK","","","","","","","x","","","","","","","","Scolaires","Produits laitiers","Laitage",""]
["2023-05-15","DU 15 AU 19 MAI 2023","LUNDI",null,"Dessert bis","45061Dessert bis","","","","","","","","","","","","","","","","","","","",""]
["2023-05-15","DU 15 AU 19 MAI 2023","LUNDI","Rôti de volaille au jus","Alternative sans porc","45061Alternative sans porc","Rôti de volaille au jus","OK","x","","x","","","","x","x","x","x","","x","","","Scolaires","Plat","Volaille",""]
["2023-05-15","DU 15 AU 19 MAI 2023","LUNDI","Dhal de lentilles aux carottes et boulgour","Alternative végétarien","45061Alternative végétarien","Dhal de lentilles aux carottes et boulgour","OK","x","","x","","","","x","","x","x","","","x","","Scolaires","Garniture","Salades et plats composés",""]
["2023-05-16","DU 15 AU 19 MAI 2023","MARDI","REPAS STREET FOOD","Thème","45062Thème","REPAS STREET FOOD","","","","","","","","","","","","","","","","","","",""]
["2023-05-16","DU 15 AU 19 MAI 2023","MARDI","","Entrée","45062Entrée","","","","","","","","","","","","","","","","","","","",""]
["2023-05-16","DU 15 AU 19 MAI 2023","MARDI",null,"Entrée bis","45062Entrée bis","","","","","","","","","","","","","","","","","","","",""]
["2023-05-16","DU 15 AU 19 MAI 2023","MARDI","Emincé de poulet grillé aux épices, sauce blanche","Plat","45062Plat","Emincé de poulet grillé aux épices, sauce blanche","OK","x","","","","","","x","","x","x","","x","","","Scolaires","Plat","Volaille",""]
["2023-05-16","DU 15 AU 19 MAI 2023","MARDI","Pomme de terre","Garniture","45062Garniture","Pomme de terre","OK","","","","","","","","","","","","","","","Scolaires","Garniture","Féculents",""]
["2023-05-16","DU 15 AU 19 MAI 2023","MARDI","Emmental à la coupe","Fromage ou laitage","45062Fromage ou laitage","Emmental à la coupe","OK","","","","","","","x","","","","","","","","Scolaires","Fromage et laitage","Fromages",""]
["2023-05-16","DU 15 AU 19 MAI 2023","MARDI",null,"Fromage ou laitage bis","45062Fromage ou laitage bis","","","","","","","","","","","","","","","","","","","",""]
["2023-05-16","DU 15 AU 19 MAI 2023","MARDI","Yaourt nature sucré bio","Dessert","45062Dessert","Yaourt nature sucré bio","OK","","","","","","","x","","","","","","","","Scolaires","Produits laitiers BIO","Laitage",""]
["2023-05-16","DU 15 AU 19 MAI 2023","MARDI",null,"Dessert bis","45062Dessert bis","","","","","","","","","","","","","","","","","","","",""]
["2023-05-16","DU 15 AU 19 MAI 2023","MARDI",null,"Alternative sans porc","45062Alternative sans porc","","","","","","","","","","","","","","","","","","","",""]
["2023-05-16","DU 15 AU 19 MAI 2023","MARDI","Emincé végétal, sauce blanche","Alternative végétarien","45062Alternative végétarien","Emincé végétal, sauce blanche","OK","x","","x","","","x","x","","x","","x","","","","Scolaires","Plat","Végétarien",""]
["2023-05-17","DU 15 AU 19 MAI 2023","MERCREDI","REPAS VEGETARIEN","Thème","45063Thème","REPAS VEGETARIEN","","","","","","","","","","","","","","","","","","",""]
["2023-05-17","DU 15 AU 19 MAI 2023","MERCREDI","","Entrée","45063Entrée","","","","","","","","","","","","","","","","","","","",""]
["2023-05-17","DU 15 AU 19 MAI 2023","MERCREDI",null,"Entrée bis","45063Entrée bis","","","","","","","","","","","","","","","","","","","",""]
["2023-05-17","DU 15 AU 19 MAI 2023","MERCREDI","Parmentier végétarien BIO","Plat","45063Plat","Parmentier végétarien BIO","OK","x","","x","","","x","x","","x","x","","x","","","Scolaires","Plat","Végétarien",""]
["2023-05-17","DU 15 AU 19 MAI 2023","MERCREDI","à l'égréné végétal","Garniture","45063Garniture","à l'égréné végétal","OK","x","","x","","","x","x","","","","","","","","Scolaires","Plat","Végétarien",""]
["2023-05-17","DU 15 AU 19 MAI 2023","MERCREDI","Coulommier à la coupe","Fromage ou laitage","45063Fromage ou laitage","Coulommier à la coupe","OK","","","","","","","x","","","","","","","","Scolaires","Fromage et laitage","Fromages",""]
["2023-05-17","DU 15 AU 19 MAI 2023","MERCREDI",null,"Fromage ou laitage bis","45063Fromage ou laitage bis","","","","","","","","","","","","","","","","","","","",""]
["2023-05-17","DU 15 AU 19 MAI 2023","MERCREDI","Crème dessert chocolat","Dessert","45063Dessert","Crème dessert chocolat","OK","","","","","","x","x","","","","","","","","Scolaires","Produits laitiers","Laitage",""]
["2023-05-17","DU 15 AU 19 MAI 2023","MERCREDI",null,"Dessert bis","45063Dessert bis","","","","","","","","","","","","","","","","","","","",""]
["2023-05-17","DU 15 AU 19 MAI 2023","MERCREDI",null,"Alternative sans porc","45063Alternative sans porc","","","","","","","","","","","","","","","","","","","",""]
["2023-05-17","DU 15 AU 19 MAI 2023","MERCREDI",null,"Alternative végétarien","45063Alternative végétarien","","","","","","","","","","","","","","","","","","","",""]
["2023-05-18","DU 15 AU 19 MAI 2023","JEUDI",null,"Thème","45064Thème","","","","","","","","","","","","","","","","","","","",""]
["2023-05-18","DU 15 AU 19 MAI 2023","JEUDI",null,"Entrée","45064Entrée","","","","","","","","","","","","","","","","","","","",""]
["2023-05-18","DU 15 AU 19 MAI 2023","JEUDI",null,"Entrée bis","45064Entrée bis","","","","","","","","","","","","","","","","","","","",""]
["2023-05-18","DU 15 AU 19 MAI 2023","JEUDI",null,"Plat","45064Plat","","","","","","","","","","","","","","","","","","","",""]
["2023-05-18","DU 15 AU 19 MAI 2023","JEUDI",null,"Garniture","45064Garniture","","","","","","","","","","","","","","","","","","","",""]
["2023-05-18","DU 15 AU 19 MAI 2023","JEUDI",null,"Fromage ou laitage","45064Fromage ou laitage","","","","","","","","","","","","","","","","","","","",""]
["2023-05-18","DU 15 AU 19 MAI 2023","JEUDI",null,"Fromage ou laitage bis","45064Fromage ou laitage bis","","","","","","","","","","","","","","","","","","","",""]
["2023-05-18","DU 15 AU 19 MAI 2023","JEUDI",null,"Dessert","45064Dessert","","","","","","","","","","","","","","","","","","","",""]
["2023-05-18","DU 15 AU 19 MAI 2023","JEUDI",null,"Dessert bis","45064Dessert bis","","","","","","","","","","","","","","","","","","","",""]
["2023-05-18","DU 15 AU 19 MAI 2023","JEUDI",null,"Alternative sans porc","45064Alternative sans porc","","","","","","","","","","","","","","","","","","","",""]
["2023-05-18","DU 15 AU 19 MAI 2023","JEUDI",null,"Alternative végétarien","45064Alternative végétarien","","","","","","","","","","","","","","","","","","","",""]
["2023-05-19","DU 15 AU 19 MAI 2023","VENDREDI",null,"Thème","45065Thème","","","","","","","","","","","","","","","","","","","",""]
["2023-05-19","DU 15 AU 19 MAI 2023","VENDREDI",null,"Entrée","45065Entrée","","","","","","","","","","","","","","","","","","","",""]
["2023-05-19","DU 15 AU 19 MAI 2023","VENDREDI",null,"Entrée bis","45065Entrée bis","","","","","","","","","","","","","","","","","","","",""]
["2023-05-19","DU 15 AU 19 MAI 2023","VENDREDI",null,"Plat","45065Plat","","","","","","","","","","","","","","","","","","","",""]
["2023-05-19","DU 15 AU 19 MAI 2023","VENDREDI",null,"Garniture","45065Garniture","","","","","","","","","","","","","","","","","","","",""]
["2023-05-19","DU 15 AU 19 MAI 2023","VENDREDI",null,"Fromage ou laitage","45065Fromage ou laitage","","","","","","","","","","","","","","","","","","","",""]
["2023-05-19","DU 15 AU 19 MAI 2023","VENDREDI",null,"Fromage ou laitage bis","45065Fromage ou laitage bis","","","","","","","","","","","","","","","","","","","",""]
["2023-05-19","DU 15 AU 19 MAI 2023","VENDREDI",null,"Dessert","45065Dessert","","","","","","","","","","","","","","","","","","","",""]
["2023-05-19","DU 15 AU 19 MAI 2023","VENDREDI",null,"Dessert bis","45065Dessert bis","","","","","","","","","","","","","","","","","","","",""]
["2023-05-19","DU 15 AU 19 MAI 2023","VENDREDI",null,"Alternative sans porc","45065Alternative sans porc","","","","","","","","","","","","","","","","","","","",""]
["2023-05-19","DU 15 AU 19 MAI 2023","VENDREDI",null,"Alternative végétarien","45065Alternative végétarien","","","","","","","","","","","","","","","","","","","",""]
["2023-05-20","DU 15 AU 19 MAI 2023","SAMEDI",null,"Thème","45066Thème","","","","","","","","","","","","","","","","","","","",""]
["2023-05-20","DU 15 AU 19 MAI 2023","SAMEDI",null,"Entrée","45066Entrée","","","","","","","","","","","","","","","","","","","",""]
["2023-05-20","DU 15 AU 19 MAI 2023","SAMEDI",null,"Entrée bis","45066Entrée bis","","","","","","","","","","","","","","","","","","","",""]
["2023-05-20","DU 15 AU 19 MAI 2023","SAMEDI",null,"Plat","45066Plat","","","","","","","","","","","","","","","","","","","",""]
["2023-05-20","DU 15 AU 19 MAI 2023","SAMEDI",null,"Garniture","45066Garniture","","","","","","","","","","","","","","","","","","","",""]
["2023-05-20","DU 15 AU 19 MAI 2023","SAMEDI",null,"Fromage ou laitage","45066Fromage ou laitage","","","","","","","","","","","","","","","","","","","",""]
["2023-05-20","DU 15 AU 19 MAI 2023","SAMEDI",null,"Fromage ou laitage bis","45066Fromage ou laitage bis","","","","","","","","","","","","","","","","","","","",""]
["2023-05-20","DU 15 AU 19 MAI 2023","SAMEDI",null,"Dessert","45066Dessert","","","","","","","","","","","","","","","","","","","",""]
["2023-05-20","DU 15 AU 19 MAI 2023","SAMEDI",null,"Dessert bis","45066Dessert bis","","","","","","","","","","","","","","","","","","","",""]
["2023-05-20","DU 15 AU 19 MAI 2023","SAMEDI",null,"Alternative sans porc","45066Alternative sans porc","","","","","","","","","","","","","","","","","","","",""]
["2023-05-20","DU 15 AU 19 MAI 2023","SAMEDI",null,"Alternative végétarien","45066Alternative végétarien","","","","","","","","","","","","","","","","","","","",""]
["2023-05-21","DU 15 AU 19 MAI 2023","DIMANCHE",null,"Thème","45067Thème","","","","","","","","","","","","","","","","","","","",""]
["2023-05-21","DU 15 AU 19 MAI 2023","DIMANCHE",null,"Entrée","45067Entrée","","","","","","","","","","","","","","","","","","","",""]
["2023-05-21","DU 15 AU 19 MAI 2023","DIMANCHE",null,"Entrée bis","45067Entrée bis","","","","","","","","","","","","","","","","","","","",""]
["2023-05-21","DU 15 AU 19 MAI 2023","DIMANCHE",null,"Plat","45067Plat","","","","","","","","","","","","","","","","","","","",""]
["2023-05-21","DU 15 AU 19 MAI 2023","DIMANCHE",null,"Garniture","45067Garniture","","","","","","","","","","","","","","","","","","","",""]
["2023-05-21","DU 15 AU 19 MAI 2023","DIMANCHE",null,"Fromage ou laitage","45067Fromage ou laitage","","","","","","","","","","","","","","","","","","","",""]
["2023-05-21","DU 15 AU 19 MAI 2023","DIMANCHE",null,"Fromage ou laitage bis","45067Fromage ou laitage bis","","","","","","","","","","","","","","","","","","","",""]
["2023-05-21","DU 15 AU 19 MAI 2023","DIMANCHE",null,"Dessert","45067Dessert","","","","","","","","","","","","","","","","","","","",""]
["2023-05-21","DU 15 AU 19 MAI 2023","DIMANCHE",null,"Dessert bis","45067Dessert bis","","","","","","","","","","","","","","","","","","","",""]
["2023-05-21","DU 15 AU 19 MAI 2023","DIMANCHE",null,"Alternative sans porc","45067Alternative sans porc","","","","","","","","","","","","","","","","","","","",""]
["2023-05-21","DU 15 AU 19 MAI 2023","DIMANCHE",null,"Alternative végétarien","45067Alternative végétarien","","","","","","","","","","","","","","","","","","","",""]
["2023-05-22","DU 22 AU 26 MAI 2023","LUNDI","REPAS VEGETARIEN","Thème","45068Thème","REPAS VEGETARIEN","","","","","","","","","","","","","","","","","","",""]
["2023-05-22","DU 22 AU 26 MAI 2023","LUNDI","Salade de céleri BIO persillée","Entrée","45068Entrée","Salade de céleri BIO persillée","OK","","","","","","","","","x","x","","x","","","Scolaires","Entrée BIO","Crudité",""]
["2023-05-22","DU 22 AU 26 MAI 2023","LUNDI",null,"Entrée bis","45068Entrée bis","","","","","","","","","","","","","","","","","","","",""]
["2023-05-22","DU 22 AU 26 MAI 2023","LUNDI","Falafels végétales au jus","Plat","45068Plat","Falafels végétales au jus","OK","x","","x","x","","x","x","","x","","","x","","x","Scolaires","Plat","Végétarien",""]
["2023-05-22","DU 22 AU 26 MAI 2023","LUNDI","Semoule et ratatouille","Garniture","45068Garniture","Semoule et ratatouille","OK","x","","x","","","","x","","x","","","","","","Scolaires","Garniture","Féculents / Légumes verts",""]
["2023-05-22","DU 22 AU 26 MAI 2023","LUNDI","","Fromage ou laitage","45068Fromage ou laitage","","","","","","","","","","","","","","","","","","","",""]
["2023-05-22","DU 22 AU 26 MAI 2023","LUNDI",null,"Fromage ou laitage bis","45068Fromage ou laitage bis","","","","","","","","","","","","","","","","","","","",""]
["2023-05-22","DU 22 AU 26 MAI 2023","LUNDI","Fruit de saison","Dessert","45068Dessert","Fruit de saison","OK","","","","","","","","","","","","","","","Scolaires","Dessert","Fruit cru ou cuit",""]
["2023-05-22","DU 22 AU 26 MAI 2023","LUNDI",null,"Dessert bis","45068Dessert bis","","","","","","","","","","","","","","","","","","","",""]
["2023-05-22","DU 22 AU 26 MAI 2023","LUNDI",null,"Alternative sans porc","45068Alternative sans porc","","","","","","","","","","","","","","","","","","","",""]
["2023-05-22","DU 22 AU 26 MAI 2023","LUNDI",null,"Alternative végétarien","45068Alternative végétarien","","","","","","","","","","","","","","","","","","","",""]
["2023-05-23","DU 22 AU 26 MAI 2023","MARDI",null,"Thème","45069Thème","","","","","","","","","","","","","","","","","","","",""]
["2023-05-23","DU 22 AU 26 MAI 2023","MARDI","Salade de radis BIO","Entrée","45069Entrée","Salade de radis BIO","OK","","","","","","","","","x","x","","","","","Scolaires","Entrée","Crudité",""]
["2023-05-23","DU 22 AU 26 MAI 2023","MARDI",null,"Entrée bis","45069Entrée bis","","","","","","","","","","","","","","","","","","","",""]
["2023-05-23","DU 22 AU 26 MAI 2023","MARDI","Nuggets de poisson sauce tartare","Plat","45069Plat","Nuggets de poisson sauce tartare","OK","x","","","x","","","x","","","x","","x","","","Scolaires","Plat","Poisson",""]
["2023-05-23","DU 22 AU 26 MAI 2023","MARDI","Petits pois carottes","Garniture","45069Garniture","Petits pois carottes","OK","x","","x","","","","x","","x","","","","","","Scolaires","Garniture","Légumes verts",""]
["2023-05-23","DU 22 AU 26 MAI 2023","MARDI","","Fromage ou laitage","45069Fromage ou laitage","","","","","","","","","","","","","","","","","","","",""]
["2023-05-23","DU 22 AU 26 MAI 2023","MARDI",null,"Fromage ou laitage bis","45069Fromage ou laitage bis","","","","","","","","","","","","","","","","","","","",""]
["2023-05-23","DU 22 AU 26 MAI 2023","MARDI","Yaourt aromatisé","Dessert","45069Dessert","Yaourt aromatisé","OK","","","","","","","x","","","","","","","","Scolaires","Produits laitiers","Laitage",""]
["2023-05-23","DU 22 AU 26 MAI 2023","MARDI",null,"Dessert bis","45069Dessert bis","","","","","","","","","","","","","","","","","","","",""]
["2023-05-23","DU 22 AU 26 MAI 2023","MARDI",null,"Alternative sans porc","45069Alternative sans porc","","","","","","","","","","","","","","","","","","","",""]
["2023-05-23","DU 22 AU 26 MAI 2023","MARDI","Nuggets végétariennes sauce tartare","Alternative végétarien","45069Alternative végétarien","Nuggets végétariennes sauce tartare","OK","x","","x","x","","x","x","","x","x","","","","x","Scolaires","Plat (brake)","Végétarien",""]
["2023-05-24","DU 22 AU 26 MAI 2023","MERCREDI",null,"Thème","45070Thème","","","","","","","","","","","","","","","","","","","",""]
["2023-05-24","DU 22 AU 26 MAI 2023","MERCREDI","","Entrée","45070Entrée","","","","","","","","","","","","","","","","","","","",""]
["2023-05-24","DU 22 AU 26 MAI 2023","MERCREDI",null,"Entrée bis","45070Entrée bis","","","","","","","","","","","","","","","","","","","",""]
["2023-05-24","DU 22 AU 26 MAI 2023","MERCREDI","Sauté de volaille au pesto","Plat","45070Plat","Sauté de volaille au pesto","OK","x","x","x","x","x","x","x","x","x","","","","","x","Scolaires","Plat BIO","Volaille",""]
["2023-05-24","DU 22 AU 26 MAI 2023","MERCREDI","Fusilli","Garniture","45070Garniture","Fusilli","OK","x","","x","","","","x","","x","","","","","","Scolaires","Garniture","Féculents / Légumes verts",""]
["2023-05-24","DU 22 AU 26 MAI 2023","MERCREDI","Brie","Fromage ou laitage","45070Fromage ou laitage","Brie","OK","","","","","","","x","","","","","","","","Scolaires","Fromage et laitage","Fromages",""]
["2023-05-24","DU 22 AU 26 MAI 2023","MERCREDI",null,"Fromage ou laitage bis","45070Fromage ou laitage bis","","","","","","","","","","","","","","","","","","","",""]
["2023-05-24","DU 22 AU 26 MAI 2023","MERCREDI","Compote de fruit BIO","Dessert","45070Dessert","Compote de fruit BIO","OK","","","","","","","","","","","","","","","Scolaires","Dessert BIO","Fruit cru ou cuit",""]
["2023-05-24","DU 22 AU 26 MAI 2023","MERCREDI",null,"Dessert bis","45070Dessert bis","","","","","","","","","","","","","","","","","","","",""]
["2023-05-24","DU 22 AU 26 MAI 2023","MERCREDI",null,"Alternative sans porc","45070Alternative sans porc","","","","","","","","","","","","","","","","","","","",""]
["2023-05-24","DU 22 AU 26 MAI 2023","MERCREDI","Tortellinis ricotta épinards","Alternative végétarien","45070Alternative végétarien","Tortellinis ricotta épinards","OK","x","","x","","","x","x","","x","","","","","","Scolaires","Plat","Végétarien",""]
["2023-05-25","DU 22 AU 26 MAI 2023","JEUDI",null,"Thème","45071Thème","","","","","","","","","","","","","","","","","","","",""]
["2023-05-25","DU 22 AU 26 MAI 2023","JEUDI","Salade de carottes BIO","Entrée","45071Entrée","Salade de carottes BIO","OK","","","","","","","","","x","x","","x","","","Scolaires","Entrée BIO","Crudité",""]
["2023-05-25","DU 22 AU 26 MAI 2023","JEUDI",null,"Entrée bis","45071Entrée bis","","","","","","","","","","","","","","","","","","","",""]
["2023-05-25","DU 22 AU 26 MAI 2023","JEUDI","Emincé de bœuf aux échalotes","Plat","45071Plat","Emincé de bœuf aux échalotes","OK","x","","x","","","","x","x","x","x","","x","","","Scolaires","Plat","Bœuf",""]
["2023-05-25","DU 22 AU 26 MAI 2023","JEUDI","Riz et chou de bruxelles","Garniture","45071Garniture","Riz et chou de bruxelles","OK","x","","x","","","","x","","x","","","","","","Scolaires","Garniture ","Féculents / Légumes verts",""]
["2023-05-25","DU 22 AU 26 MAI 2023","JEUDI","","Fromage ou laitage","45071Fromage ou laitage","","","","","","","","","","","","","","","","","","","",""]
["2023-05-25","DU 22 AU 26 MAI 2023","JEUDI",null,"Fromage ou laitage bis","45071Fromage ou laitage bis","","","","","","","","","","","","","","","","","","","",""]
["2023-05-25","DU 22 AU 26 MAI 2023","JEUDI","Tarte pomme rhubarbe","Dessert","45071Dessert","Tarte pomme rhubarbe","OK","x","","x","","x","x","x","x","","","","","","","Scolaires","Dessert","Pâtisserie",""]
["2023-05-25","DU 22 AU 26 MAI 2023","JEUDI",null,"Dessert bis","45071Dessert bis","","","","","","","","","","","","","","","","","","","",""]
["2023-05-25","DU 22 AU 26 MAI 2023","JEUDI",null,"Alternative sans porc","45071Alternative sans porc","","","","","","","","","","","","","","","","","","","",""]
["2023-05-25","DU 22 AU 26 MAI 2023","JEUDI","Falafel en sauce","Alternative végétarien","45071Alternative végétarien","Falafel en sauce","OK","x","","x","x","","x","x","","x","","","x","","x","Scolaires","Plat","Végétarien",""]
["2023-05-26","DU 22 AU 26 MAI 2023","VENDREDI",null,"Thème","45072Thème","","","","","","","","","","","","","","","","","","","",""]
["2023-05-26","DU 22 AU 26 MAI 2023","VENDREDI","","Entrée","45072Entrée","","","","","","","","","","","","","","","","","","","",""]
["2023-05-26","DU 22 AU 26 MAI 2023","VENDREDI",null,"Entrée bis","45072Entrée bis","","","","","","","","","","","","","","","","","","","",""]
["2023-05-26","DU 22 AU 26 MAI 2023","VENDREDI","Mijoté de veau grand-mère","Plat","45072Plat","Mijoté de veau grand-mère","OK","x","","x","","","","x","","x","x","","","","","Scolaires","Plat","Veau",""]
["2023-05-26","DU 22 AU 26 MAI 2023","VENDREDI","Spaetzle","Garniture","45072Garniture","Spaetzle","OK","x","","x","","","","","","","","","","","","Scolaires","Garniture","Féculents",""]
["2023-05-26","DU 22 AU 26 MAI 2023","VENDREDI","Fromage aux fines herbes BIO","Fromage ou laitage","45072Fromage ou laitage","Fromage aux fines herbes BIO","OK","","","","","","","x","","","","","","","","Scolaires","","",""]
["2023-05-26","DU 22 AU 26 MAI 2023","VENDREDI",null,"Fromage ou laitage bis","45072Fromage ou laitage bis","","","","","","","","","","","","","","","","","","","",""]
["2023-05-26","DU 22 AU 26 MAI 2023","VENDREDI","Fruit de saison","Dessert","45072Dessert","Fruit de saison","OK","","","","","","","","","","","","","","","Scolaires","Dessert","Fruit cru ou cuit",""]
["2023-05-26","DU 22 AU 26 MAI 2023","VENDREDI",null,"Dessert bis","45072Dessert bis","","","","","","","","","","","","","","","","","","","",""]
["2023-05-26","DU 22 AU 26 MAI 2023","VENDREDI",null,"Alternative sans porc","45072Alternative sans porc","","","","","","","","","","","","","","","","","","","",""]
["2023-05-26","DU 22 AU 26 MAI 2023","VENDREDI","Egréné végétal sauce végétarienne","Alternative végétarien","45072Alternative végétarien","Egréné végétal sauce végétarienne","OK","x","","x","x","","x","x","","x","","","","","","Scolaires","Plat","Végétarien",""]
["2023-05-27","DU 22 AU 26 MAI 2023","SAMEDI",null,"Thème","45073Thème","","","","","","","","","","","","","","","","","","","",""]
["2023-05-27","DU 22 AU 26 MAI 2023","SAMEDI",null,"Entrée","45073Entrée","","","","","","","","","","","","","","","","","","","",""]
["2023-05-27","DU 22 AU 26 MAI 2023","SAMEDI",null,"Entrée bis","45073Entrée bis","","","","","","","","","","","","","","","","","","","",""]
["2023-05-27","DU 22 AU 26 MAI 2023","SAMEDI",null,"Plat","45073Plat","","","","","","","","","","","","","","","","","","","",""]
["2023-05-27","DU 22 AU 26 MAI 2023","SAMEDI",null,"Garniture","45073Garniture","","","","","","","","","","","","","","","","","","","",""]
["2023-05-27","DU 22 AU 26 MAI 2023","SAMEDI",null,"Fromage ou laitage","45073Fromage ou laitage","","","","","","","","","","","","","","","","","","","",""]
["2023-05-27","DU 22 AU 26 MAI 2023","SAMEDI",null,"Fromage ou laitage bis","45073Fromage ou laitage bis","","","","","","","","","","","","","","","","","","","",""]
["2023-05-27","DU 22 AU 26 MAI 2023","SAMEDI",null,"Dessert","45073Dessert","","","","","","","","","","","","","","","","","","","",""]
["2023-05-27","DU 22 AU 26 MAI 2023","SAMEDI",null,"Dessert bis","45073Dessert bis","","","","","","","","","","","","","","","","","","","",""]
["2023-05-27","DU 22 AU 26 MAI 2023","SAMEDI",null,"Alternative sans porc","45073Alternative sans porc","","","","","","","","","","","","","","","","","","","",""]
["2023-05-27","DU 22 AU 26 MAI 2023","SAMEDI",null,"Alternative végétarien","45073Alternative végétarien","","","","","","","","","","","","","","","","","","","",""]
["2023-05-28","DU 22 AU 26 MAI 2023","DIMANCHE",null,"Thème","45074Thème","","","","","","","","","","","","","","","","","","","",""]
["2023-05-28","DU 22 AU 26 MAI 2023","DIMANCHE",null,"Entrée","45074Entrée","","","","","","","","","","","","","","","","","","","",""]
["2023-05-28","DU 22 AU 26 MAI 2023","DIMANCHE",null,"Entrée bis","45074Entrée bis","","","","","","","","","","","","","","","","","","","",""]
["2023-05-28","DU 22 AU 26 MAI 2023","DIMANCHE",null,"Plat","45074Plat","","","","","","","","","","","","","","","","","","","",""]
["2023-05-28","DU 22 AU 26 MAI 2023","DIMANCHE",null,"Garniture","45074Garniture","","","","","","","","","","","","","","","","","","","",""]
["2023-05-28","DU 22 AU 26 MAI 2023","DIMANCHE",null,"Fromage ou laitage","45074Fromage ou laitage","","","","","","","","","","","","","","","","","","","",""]
["2023-05-28","DU 22 AU 26 MAI 2023","DIMANCHE",null,"Fromage ou laitage bis","45074Fromage ou laitage bis","","","","","","","","","","","","","","","","","","","",""]
["2023-05-28","DU 22 AU 26 MAI 2023","DIMANCHE",null,"Dessert","45074Dessert","","","","","","","","","","","","","","","","","","","",""]
["2023-05-28","DU 22 AU 26 MAI 2023","DIMANCHE",null,"Dessert bis","45074Dessert bis","","","","","","","","","","","","","","","","","","","",""]
["2023-05-28","DU 22 AU 26 MAI 2023","DIMANCHE",null,"Alternative sans porc","45074Alternative sans porc","","","","","","","","","","","","","","","","","","","",""]
["2023-05-28","DU 22 AU 26 MAI 2023","DIMANCHE",null,"Alternative végétarien","45074Alternative végétarien","","","","","","","","","","","","","","","","","","","",""]
["2023-05-29","DU 29 MAI AU 2 JUIN 2023","LUNDI",null,"Thème","45075Thème","","","","","","","","","","","","","","","","","","","",""]
["2023-05-29","DU 29 MAI AU 2 JUIN 2023","LUNDI",null,"Entrée","45075Entrée","","","","","","","","","","","","","","","","","","","",""]
["2023-05-29","DU 29 MAI AU 2 JUIN 2023","LUNDI",null,"Entrée bis","45075Entrée bis","","","","","","","","","","","","","","","","","","","",""]
["2023-05-29","DU 29 MAI AU 2 JUIN 2023","LUNDI",null,"Plat","45075Plat","","","","","","","","","","","","","","","","","","","",""]
["2023-05-29","DU 29 MAI AU 2 JUIN 2023","LUNDI",null,"Garniture","45075Garniture","","","","","","","","","","","","","","","","","","","",""]
["2023-05-29","DU 29 MAI AU 2 JUIN 2023","LUNDI",null,"Fromage ou laitage","45075Fromage ou laitage","","","","","","","","","","","","","","","","","","","",""]
["2023-05-29","DU 29 MAI AU 2 JUIN 2023","LUNDI",null,"Fromage ou laitage bis","45075Fromage ou laitage bis","","","","","","","","","","","","","","","","","","","",""]
["2023-05-29","DU 29 MAI AU 2 JUIN 2023","LUNDI",null,"Dessert","45075Dessert","","","","","","","","","","","","","","","","","","","",""]
["2023-05-29","DU 29 MAI AU 2 JUIN 2023","LUNDI",null,"Dessert bis","45075Dessert bis","","","","","","","","","","","","","","","","","","","",""]
["2023-05-29","DU 29 MAI AU 2 JUIN 2023","LUNDI",null,"Alternative sans porc","45075Alternative sans porc","","","","","","","","","","","","","","","","","","","",""]
["2023-05-29","DU 29 MAI AU 2 JUIN 2023","LUNDI",null,"Alternative végétarien","45075Alternative végétarien","","","","","","","","","","","","","","","","","","","",""]
["2023-05-30","DU 29 MAI AU 2 JUIN 2023","MARDI","REPAS VEGETARIEN","Thème","45076Thème","REPAS VEGETARIEN","","","","","","","","","","","","","","","","","","",""]
["2023-05-30","DU 29 MAI AU 2 JUIN 2023","MARDI","","Entrée","45076Entrée","","","","","","","","","","","","","","","","","","","",""]
["2023-05-30","DU 29 MAI AU 2 JUIN 2023","MARDI",null,"Entrée bis","45076Entrée bis","","","","","","","","","","","","","","","","","","","",""]
["2023-05-30","DU 29 MAI AU 2 JUIN 2023","MARDI","Galette végétale légumes et mozzarella","Plat","45076Plat","Galette végétale légumes et mozzarella","OK","x","","x","","","x","x","","x","","x","","","","Scolaires","Plat","Végétarien",""]
["2023-05-30","DU 29 MAI AU 2 JUIN 2023","MARDI","Courgettes BIO sauce tomate","Garniture","45076Garniture","Courgettes BIO sauce tomate","OK","x","","x","","x","x","x","x","x","","","","","x","Scolaires","Garniture BIO","Légumes verts",""]
["2023-05-30","DU 29 MAI AU 2 JUIN 2023","MARDI","Cantadou","Fromage ou laitage","45076Fromage ou laitage","Cantadou","OK","","","","","","","x","","","","","","","","Scolaires","Fromage et laitage","Fromages",""]
["2023-05-30","DU 29 MAI AU 2 JUIN 2023","MARDI",null,"Fromage ou laitage bis","45076Fromage ou laitage bis","","","","","","","","","","","","","","","","","","","",""]
["2023-05-30","DU 29 MAI AU 2 JUIN 2023","MARDI","Fondant au chocolat","Dessert","45076Dessert","Fondant au chocolat","OK","x","","x","","","x","x","","","","","","","","Scolaires","Dessert","Pâtisserie",""]
["2023-05-30","DU 29 MAI AU 2 JUIN 2023","MARDI",null,"Dessert bis","45076Dessert bis","","","","","","","","","","","","","","","","","","","",""]
["2023-05-30","DU 29 MAI AU 2 JUIN 2023","MARDI",null,"Alternative sans porc","45076Alternative sans porc","","","","","","","","","","","","","","","","","","","",""]
["2023-05-30","DU 29 MAI AU 2 JUIN 2023","MARDI",null,"Alternative végétarien","45076Alternative végétarien","","","","","","","","","","","","","","","","","","","",""]
["2023-05-31","DU 29 MAI AU 2 JUIN 2023","MERCREDI",null,"Thème","45077Thème","","","","","","","","","","","","","","","","","","","",""]
["2023-05-31","DU 29 MAI AU 2 JUIN 2023","MERCREDI","","Entrée","45077Entrée","","","","","","","","","","","","","","","","","","","",""]
["2023-05-31","DU 29 MAI AU 2 JUIN 2023","MERCREDI",null,"Entrée bis","45077Entrée bis","","","","","","","","","","","","","","","","","","","",""]
["2023-05-31","DU 29 MAI AU 2 JUIN 2023","MERCREDI","Pépites de colin aux 3 céréales, sauce rémoulade","Plat","45077Plat","Pépites de colin aux 3 céréales, sauce rémoulade","OK","x","","x","x","","","x","","","x","","","","x","Scolaires","Plat","Poisson",""]
["2023-05-31","DU 29 MAI AU 2 JUIN 2023","MERCREDI","Epinards à la crème","Garniture","45077Garniture","Epinards à la crème","OK","x","","x","","","","x","","x","","","","","","Scolaires","Garniture","Légumes verts",""]
["2023-05-31","DU 29 MAI AU 2 JUIN 2023","MERCREDI","Camembert","Fromage ou laitage","45077Fromage ou laitage","Camembert","OK","","","","","","","x","","","","","","","","Scolaires","Fromage et laitage","Fromages",""]
["2023-05-31","DU 29 MAI AU 2 JUIN 2023","MERCREDI",null,"Fromage ou laitage bis","45077Fromage ou laitage bis","","","","","","","","","","","","","","","","","","","",""]
["2023-05-31","DU 29 MAI AU 2 JUIN 2023","MERCREDI","Fruit de saison BIO","Dessert","45077Dessert","Fruit de saison BIO","OK","","","","","","","","","","","","","","","Scolaires","Dessert BIO","Fruit cru ou cuit",""]
["2023-05-31","DU 29 MAI AU 2 JUIN 2023","MERCREDI",null,"Dessert bis","45077Dessert bis","","","","","","","","","","","","","","","","","","","",""]
["2023-05-31","DU 29 MAI AU 2 JUIN 2023","MERCREDI",null,"Alternative sans porc","45077Alternative sans porc","","","","","","","","","","","","","","","","","","","",""]
["2023-05-31","DU 29 MAI AU 2 JUIN 2023","MERCREDI","Beignet de légumes, sauce rémoulade","Alternative végétarien","45077Alternative végétarien","Beignet de légumes, sauce rémoulade","OK","x","","x","","","","x","","x","x","","x","","","Scolaires","Ganiture","Légumes verts",""]
["2023-06-01","DU 29 MAI AU 2 JUIN 2023","JEUDI",null,"Thème","45078Thème","","","","","","","","","","","","","","","","","","","",""]
["2023-06-01","DU 29 MAI AU 2 JUIN 2023","JEUDI","Salade de céleri BIO","Entrée","45078Entrée","Salade de céleri BIO","OK","","","","","","","","","x","x","","x","","","Scolaires","Entrée BIO","Crudité",""]
["2023-06-01","DU 29 MAI AU 2 JUIN 2023","JEUDI",null,"Entrée bis","45078Entrée bis","","","","","","","","","","","","","","","","","","","",""]
["2023-06-01","DU 29 MAI AU 2 JUIN 2023","JEUDI","Sauté de porc aux pêches","Plat","45078Plat","Sauté de porc aux pêches","OK","x","","x","","","","x","x","x","x","","x","","","Scolaires","Plat","Porc",""]
["2023-06-01","DU 29 MAI AU 2 JUIN 2023","JEUDI","Boulgour et petits légumes aux épices","Garniture","45078Garniture","Boulgour et petits légumes aux épices","OK","x","","x","","","","x","","x","","","","","","Scolaires","Garniture","Féculents / Légumes verts",""]
["2023-06-01","DU 29 MAI AU 2 JUIN 2023","JEUDI","","Fromage ou laitage","45078Fromage ou laitage","","","","","","","","","","","","","","","","","","","",""]
["2023-06-01","DU 29 MAI AU 2 JUIN 2023","JEUDI",null,"Fromage ou laitage bis","45078Fromage ou laitage bis","","","","","","","","","","","","","","","","","","","",""]
["2023-06-01","DU 29 MAI AU 2 JUIN 2023","JEUDI","Flan saveur vanille","Dessert","45078Dessert","Flan saveur vanille","OK","","","","","","x","x","","","","","","","","","","",""]
["2023-06-01","DU 29 MAI AU 2 JUIN 2023","JEUDI",null,"Dessert bis","45078Dessert bis","","","","","","","","","","","","","","","","","","","",""]
["2023-06-01","DU 29 MAI AU 2 JUIN 2023","JEUDI","Rôti de volaille aux pêches","Alternative sans porc","45078Alternative sans porc","Rôti de volaille aux pêches","OK","x","","x","","","","x","x","x","x","","x","","","Scolaires","Plat","Volaille",""]
["2023-06-01","DU 29 MAI AU 2 JUIN 2023","JEUDI","Boulettes de lentilles aux pêches","Alternative végétarien","45078Alternative végétarien","Boulettes de lentilles aux pêches","OK","x","","x","","","x","x","","x","","","","","","Scolaires","Plat","Végétarien",""]
["2023-06-02","DU 29 MAI AU 2 JUIN 2023","VENDREDI","MENU DES ENFANTS","Thème","45079Thème","MENU DES ENFANTS","","","","","","","","","","","","","","","","","","",""]
["2023-06-02","DU 29 MAI AU 2 JUIN 2023","VENDREDI",null,"Entrée","45079Entrée","","","","","","","","","","","","","","","","","","","",""]
["2023-06-02","DU 29 MAI AU 2 JUIN 2023","VENDREDI",null,"Entrée bis","45079Entrée bis","","","","","","","","","","","","","","","","","","","",""]
["2023-06-02","DU 29 MAI AU 2 JUIN 2023","VENDREDI",null,"Plat","45079Plat","","","","","","","","","","","","","","","","","","","",""]
["2023-06-02","DU 29 MAI AU 2 JUIN 2023","VENDREDI",null,"Garniture","45079Garniture","","","","","","","","","","","","","","","","","","","",""]
["2023-06-02","DU 29 MAI AU 2 JUIN 2023","VENDREDI",null,"Fromage ou laitage","45079Fromage ou laitage","","","","","","","","","","","","","","","","","","","",""]
["2023-06-02","DU 29 MAI AU 2 JUIN 2023","VENDREDI",null,"Fromage ou laitage bis","45079Fromage ou laitage bis","","","","","","","","","","","","","","","","","","","",""]
["2023-06-02","DU 29 MAI AU 2 JUIN 2023","VENDREDI",null,"Dessert","45079Dessert","","","","","","","","","","","","","","","","","","","",""]
["2023-06-02","DU 29 MAI AU 2 JUIN 2023","VENDREDI",null,"Dessert bis","45079Dessert bis","","","","","","","","","","","","","","","","","","","",""]
["2023-06-02","DU 29 MAI AU 2 JUIN 2023","VENDREDI",null,"Alternative sans porc","45079Alternative sans porc","","","","","","","","","","","","","","","","","","","",""]
["2023-06-02","DU 29 MAI AU 2 JUIN 2023","VENDREDI",null,"Alternative végétarien","45079Alternative végétarien","","","","","","","","","","","","","","","","","","","",""]
["2023-06-03","DU 29 MAI AU 2 JUIN 2023","SAMEDI",null,"Thème","45080Thème","","","","","","","","","","","","","","","","","","","",""]
["2023-06-03","DU 29 MAI AU 2 JUIN 2023","SAMEDI",null,"Entrée","45080Entrée","","","","","","","","","","","","","","","","","","","",""]
["2023-06-03","DU 29 MAI AU 2 JUIN 2023","SAMEDI",null,"Entrée bis","45080Entrée bis","","","","","","","","","","","","","","","","","","","",""]
["2023-06-03","DU 29 MAI AU 2 JUIN 2023","SAMEDI",null,"Plat","45080Plat","","","","","","","","","","","","","","","","","","","",""]
["2023-06-03","DU 29 MAI AU 2 JUIN 2023","SAMEDI",null,"Garniture","45080Garniture","","","","","","","","","","","","","","","","","","","",""]
["2023-06-03","DU 29 MAI AU 2 JUIN 2023","SAMEDI",null,"Fromage ou laitage","45080Fromage ou laitage","","","","","","","","","","","","","","","","","","","",""]
["2023-06-03","DU 29 MAI AU 2 JUIN 2023","SAMEDI",null,"Fromage ou laitage bis","45080Fromage ou laitage bis","","","","","","","","","","","","","","","","","","","",""]
["2023-06-03","DU 29 MAI AU 2 JUIN 2023","SAMEDI",null,"Dessert","45080Dessert","","","","","","","","","","","","","","","","","","","",""]
["2023-06-03","DU 29 MAI AU 2 JUIN 2023","SAMEDI",null,"Dessert bis","45080Dessert bis","","","","","","","","","","","","","","","","","","","",""]
["2023-06-03","DU 29 MAI AU 2 JUIN 2023","SAMEDI",null,"Alternative sans porc","45080Alternative sans porc","","","","","","","","","","","","","","","","","","","",""]
["2023-06-03","DU 29 MAI AU 2 JUIN 2023","SAMEDI",null,"Alternative végétarien","45080Alternative végétarien","","","","","","","","","","","","","","","","","","","",""]
["2023-06-04","DU 29 MAI AU 2 JUIN 2023","DIMANCHE",null,"Thème","45081Thème","","","","","","","","","","","","","","","","","","","",""]
["2023-06-04","DU 29 MAI AU 2 JUIN 2023","DIMANCHE",null,"Entrée","45081Entrée","","","","","","","","","","","","","","","","","","","",""]
["2023-06-04","DU 29 MAI AU 2 JUIN 2023","DIMANCHE",null,"Entrée bis","45081Entrée bis","","","","","","","","","","","","","","","","","","","",""]
["2023-06-04","DU 29 MAI AU 2 JUIN 2023","DIMANCHE",null,"Plat","45081Plat","","","","","","","","","","","","","","","","","","","",""]
["2023-06-04","DU 29 MAI AU 2 JUIN 2023","DIMANCHE",null,"Garniture","45081Garniture","","","","","","","","","","","","","","","","","","","",""]
["2023-06-04","DU 29 MAI AU 2 JUIN 2023","DIMANCHE",null,"Fromage ou laitage","45081Fromage ou laitage","","","","","","","","","","","","","","","","","","","",""]
["2023-06-04","DU 29 MAI AU 2 JUIN 2023","DIMANCHE",null,"Fromage ou laitage bis","45081Fromage ou laitage bis","","","","","","","","","","","","","","","","","","","",""]
["2023-06-04","DU 29 MAI AU 2 JUIN 2023","DIMANCHE",null,"Dessert","45081Dessert","","","","","","","","","","","","","","","","","","","",""]
["2023-06-04","DU 29 MAI AU 2 JUIN 2023","DIMANCHE",null,"Dessert bis","45081Dessert bis","","","","","","","","","","","","","","","","","","","",""]
["2023-06-04","DU 29 MAI AU 2 JUIN 2023","DIMANCHE",null,"Alternative sans porc","45081Alternative sans porc","","","","","","","","","","","","","","","","","","","",""]
["2023-06-04","DU 29 MAI AU 2 JUIN 2023","DIMANCHE",null,"Alternative végétarien","45081Alternative végétarien","","","","","","","","","","","","","","","","","","","",""]
["2023-06-05","DU 5 AU 9 JUIN 2023","LUNDI","REPAS VEGETARIEN","Thème","45082Thème","REPAS VEGETARIEN","","","","","","","","","","","","","","","","","","",""]
["2023-06-05","DU 5 AU 9 JUIN 2023","LUNDI","Salade de boulgour","Entrée","45082Entrée","Salade de boulgour","OK","x","","","","","","","x","x","x","","x","","","Scolaires","Entrée","Féculents",""]
["2023-06-05","DU 5 AU 9 JUIN 2023","LUNDI",null,"Entrée bis","45082Entrée bis","","","","","","","","","","","","","","","","","","","",""]
["2023-06-05","DU 5 AU 9 JUIN 2023","LUNDI","Omelette BIO aux fines herbes","Plat","45082Plat","Omelette BIO aux fines herbes","OK","","","x","","","","x","","x","","","","","","Scolaires","Plat BIO","Œuf",""]
["2023-06-05","DU 5 AU 9 JUIN 2023","LUNDI","Gratin de chou-fleur","Garniture","45082Garniture","Gratin de chou-fleur","OK","x","","x","","","","x","","x","x","","","","","Scolaires","Garniture","Légumes",""]
["2023-06-05","DU 5 AU 9 JUIN 2023","LUNDI","","Fromage ou laitage","45082Fromage ou laitage","","","","","","","","","","","","","","","","","","","",""]
["2023-06-05","DU 5 AU 9 JUIN 2023","LUNDI",null,"Fromage ou laitage bis","45082Fromage ou laitage bis","","","","","","","","","","","","","","","","","","","",""]
["2023-06-05","DU 5 AU 9 JUIN 2023","LUNDI","Crème dessert chocolat","Dessert","45082Dessert","Crème dessert chocolat","OK","","","","","","x","x","","","","","","","","Scolaires","Produits laitiers","Laitage",""]
["2023-06-05","DU 5 AU 9 JUIN 2023","LUNDI",null,"Dessert bis","45082Dessert bis","","","","","","","","","","","","","","","","","","","",""]
["2023-06-05","DU 5 AU 9 JUIN 2023","LUNDI",null,"Alternative sans porc","45082Alternative sans porc","","","","","","","","","","","","","","","","","","","",""]
["2023-06-05","DU 5 AU 9 JUIN 2023","LUNDI",null,"Alternative végétarien","45082Alternative végétarien","","","","","","","","","","","","","","","","","","","",""]
["2023-06-06","DU 5 AU 9 JUIN 2023","MARDI",null,"Thème","45083Thème","","","","","","","","","","","","","","","","","","","",""]
["2023-06-06","DU 5 AU 9 JUIN 2023","MARDI","","Entrée","45083Entrée","","","","","","","","","","","","","","","","","","","",""]
["2023-06-06","DU 5 AU 9 JUIN 2023","MARDI",null,"Entrée bis","45083Entrée bis","","","","","","","","","","","","","","","","","","","",""]
["2023-06-06","DU 5 AU 9 JUIN 2023","MARDI","Cassolette de poisson basquaise","Plat","45083Plat","Cassolette de poisson basquaise","OK","x","x","x","x","","x","x","","x","x","","x","","x","Scolaires","Plat","Poisson",""]
["2023-06-06","DU 5 AU 9 JUIN 2023","MARDI","Riz BIO","Garniture","45083Garniture","Riz BIO","OK","","","","","","","","","","","","","","","Scolaires","Garniture BIO","Féculents",""]
["2023-06-06","DU 5 AU 9 JUIN 2023","MARDI","Coulommiers à la coupe","Fromage ou laitage","45083Fromage ou laitage","Coulommiers à la coupe","OK","","","","","","","x","","","","","","","","Scolaires","Fromage et laitage","Fromages",""]
["2023-06-06","DU 5 AU 9 JUIN 2023","MARDI",null,"Fromage ou laitage bis","45083Fromage ou laitage bis","","","","","","","","","","","","","","","","","","","",""]
["2023-06-06","DU 5 AU 9 JUIN 2023","MARDI","Fruit de saison","Dessert","45083Dessert","Fruit de saison","OK","","","","","","","","","","","","","","","Scolaires","Dessert","Fruit cru ou cuit",""]
["2023-06-06","DU 5 AU 9 JUIN 2023","MARDI",null,"Dessert bis","45083Dessert bis","","","","","","","","","","","","","","","","","","","",""]
["2023-06-06","DU 5 AU 9 JUIN 2023","MARDI",null,"Alternative sans porc","45083Alternative sans porc","","","","","","","","","","","","","","","","","","","",""]
["2023-06-06","DU 5 AU 9 JUIN 2023","MARDI","Quennelles basquaise","Alternative végétarien","45083Alternative végétarien","Quennelles basquaise","OK","x","","x","x","","","x","","x","x","","x","","","Scolaires","Plat","Végétarien",""]
["2023-06-07","DU 5 AU 9 JUIN 2023","MERCREDI",null,"Thème","45084Thème","","","","","","","","","","","","","","","","","","","",""]
["2023-06-07","DU 5 AU 9 JUIN 2023","MERCREDI","Salade de radis","Entrée","45084Entrée","Salade de radis","OK","","","","","","","","","x","x","","","","","Scolaires","Entrée","Crudité",""]
["2023-06-07","DU 5 AU 9 JUIN 2023","MERCREDI",null,"Entrée bis","45084Entrée bis","","","","","","","","","","","","","","","","","","","",""]
["2023-06-07","DU 5 AU 9 JUIN 2023","MERCREDI","Rôti de bœuf à l'échalote","Plat","45084Plat","Rôti de bœuf à l'échalote","OK","x","","x","","","","x","x","x","x","","x","","","Scolaires","Plat","Volaille",""]
["2023-06-07","DU 5 AU 9 JUIN 2023","MERCREDI","Purée pommes de terre, carottes BIO","Garniture","45084Garniture","Purée pommes de terre, carottes BIO","OK","","","","","","","x","","x","","","x","","","Crèche","Garniture BIO","Purée de légumes et pommes de terre",""]
["2023-06-07","DU 5 AU 9 JUIN 2023","MERCREDI","","Fromage ou laitage","45084Fromage ou laitage","","","","","","","","","","","","","","","","","","","",""]
["2023-06-07","DU 5 AU 9 JUIN 2023","MERCREDI",null,"Fromage ou laitage bis","45084Fromage ou laitage bis","","","","","","","","","","","","","","","","","","","",""]
["2023-06-07","DU 5 AU 9 JUIN 2023","MERCREDI","Fruit de saison","Dessert","45084Dessert","Fruit de saison","OK","","","","","","","","","","","","","","","Scolaires","Dessert","Fruit cru ou cuit",""]
["2023-06-07","DU 5 AU 9 JUIN 2023","MERCREDI",null,"Dessert bis","45084Dessert bis","","","","","","","","","","","","","","","","","","","",""]
["2023-06-07","DU 5 AU 9 JUIN 2023","MERCREDI",null,"Alternative sans porc","45084Alternative sans porc","","","","","","","","","","","","","","","","","","","",""]
["2023-06-07","DU 5 AU 9 JUIN 2023","MERCREDI","Boulette de lentilles en sauce","Alternative végétarien","45084Alternative végétarien","Boulette de lentilles en sauce","OK","x","","x","","","x","x","","x","","","","","","Scolaires","Plat","Végétarien",""]
["2023-06-08","DU 5 AU 9 JUIN 2023","JEUDI",null,"Thème","45085Thème","","","","","","","","","","","","","","","","","","","",""]
["2023-06-08","DU 5 AU 9 JUIN 2023","JEUDI","","Entrée","45085Entrée","","","","","","","","","","","","","","","","","","","",""]
["2023-06-08","DU 5 AU 9 JUIN 2023","JEUDI",null,"Entrée bis","45085Entrée bis","","","","","","","","","","","","","","","","","","","",""]
["2023-06-08","DU 5 AU 9 JUIN 2023","JEUDI","Emincé de volaille façon carbonara","Plat","45085Plat","Emincé de volaille façon carbonara","OK","x","","x","","","","x","","x","x","","x","","","Scolaires","Plat","Volaille",""]
["2023-06-08","DU 5 AU 9 JUIN 2023","JEUDI","Pâtes","Garniture","45085Garniture","Pâtes","OK","x","","x","","","","","","","","","","","","Scolaires","Garniture","Féculents",""]
["2023-06-08","DU 5 AU 9 JUIN 2023","JEUDI","Emmental râpé","Fromage ou laitage","45085Fromage ou laitage","Emmental râpé","OK","","","","","","","x","","","","","","","","Scolaires","Fromage et laitage","Fromages",""]
["2023-06-08","DU 5 AU 9 JUIN 2023","JEUDI",null,"Fromage ou laitage bis","45085Fromage ou laitage bis","","","","","","","","","","","","","","","","","","","",""]
["2023-06-08","DU 5 AU 9 JUIN 2023","JEUDI","Compote de fruit BIO","Dessert","45085Dessert","Compote de fruit BIO","OK","","","","","","","","","","","","","","","Scolaires","Dessert BIO","Fruit cru ou cuit",""]
["2023-06-08","DU 5 AU 9 JUIN 2023","JEUDI",null,"Dessert bis","45085Dessert bis","","","","","","","","","","","","","","","","","","","",""]
["2023-06-08","DU 5 AU 9 JUIN 2023","JEUDI",null,"Alternative sans porc","45085Alternative sans porc","","","","","","","","","","","","","","","","","","","",""]
["2023-06-08","DU 5 AU 9 JUIN 2023","JEUDI","Pâtes carbonara végétarienne","Alternative végétarien","45085Alternative végétarien","Pâtes carbonara végétarienne","OK","x","","x","","","","x","","x","","","","","","Scolaires","Plat","Végétarien",""]
["2023-06-09","DU 5 AU 9 JUIN 2023","VENDREDI",null,"Thème","45086Thème","","","","","","","","","","","","","","","","","","","",""]
["2023-06-09","DU 5 AU 9 JUIN 2023","VENDREDI","","Entrée","45086Entrée","","","","","","","","","","","","","","","","","","","",""]
["2023-06-09","DU 5 AU 9 JUIN 2023","VENDREDI",null,"Entrée bis","45086Entrée bis","","","","","","","","","","","","","","","","","","","",""]
["2023-06-09","DU 5 AU 9 JUIN 2023","VENDREDI","Jambon braisé et son jus","Plat","45086Plat","Jambon braisé et son jus","OK","x","","x","","","","x","x","x","x","","x","","","Scolaires","Plat","Porc",""]
["2023-06-09","DU 5 AU 9 JUIN 2023","VENDREDI","Gratin dauphinois","Garniture","45086Garniture","Gratin dauphinois","OK","x","","x","","","","x","","x","","","","","","Scolaires","Garniture","Féculents",""]
["2023-06-09","DU 5 AU 9 JUIN 2023","VENDREDI","Edam BIO à la coupe","Fromage ou laitage","45086Fromage ou laitage","Edam BIO à la coupe","OK","","","","","","","x","","","","","","","","Scolaires","Produits laitiers BIO","Fromage",""]
["2023-06-09","DU 5 AU 9 JUIN 2023","VENDREDI",null,"Fromage ou laitage bis","45086Fromage ou laitage bis","","","","","","","","","","","","","","","","","","","",""]
["2023-06-09","DU 5 AU 9 JUIN 2023","VENDREDI","Crêpe sucrée","Dessert","45086Dessert","Crêpe sucrée","OK","x","","x","x","","x","x","","x","x","","x","","","Scolaires","Dessert","Pâtisserie",""]
["2023-06-09","DU 5 AU 9 JUIN 2023","VENDREDI",null,"Dessert bis","45086Dessert bis","","","","","","","","","","","","","","","","","","","",""]
["2023-06-09","DU 5 AU 9 JUIN 2023","VENDREDI","Jambon de volaille et son jus","Alternative sans porc","45086Alternative sans porc","Jambon de volaille et son jus","OK","x","","x","","","","x","x","x","x","","x","","","Scolaires","Plat","Volaille",""]
["2023-06-09","DU 5 AU 9 JUIN 2023","VENDREDI","Gratin dauphinois, petits légumes et fromage","Alternative végétarien","45086Alternative végétarien","Gratin dauphinois, petits légumes et fromage","OK","x","","x","","","","x","","x","","","","","","Scolaires","Garniture","Féculents / Légumes verts",""]
["2023-06-10","DU 5 AU 9 JUIN 2023","SAMEDI",null,"Thème","45087Thème","","","","","","","","","","","","","","","","","","","",""]
["2023-06-10","DU 5 AU 9 JUIN 2023","SAMEDI",null,"Entrée","45087Entrée","","","","","","","","","","","","","","","","","","","",""]
["2023-06-10","DU 5 AU 9 JUIN 2023","SAMEDI",null,"Entrée bis","45087Entrée bis","","","","","","","","","","","","","","","","","","","",""]
["2023-06-10","DU 5 AU 9 JUIN 2023","SAMEDI",null,"Plat","45087Plat","","","","","","","","","","","","","","","","","","","",""]
["2023-06-10","DU 5 AU 9 JUIN 2023","SAMEDI",null,"Garniture","45087Garniture","","","","","","","","","","","","","","","","","","","",""]
["2023-06-10","DU 5 AU 9 JUIN 2023","SAMEDI",null,"Fromage ou laitage","45087Fromage ou laitage","","","","","","","","","","","","","","","","","","","",""]
["2023-06-10","DU 5 AU 9 JUIN 2023","SAMEDI",null,"Fromage ou laitage bis","45087Fromage ou laitage bis","","","","","","","","","","","","","","","","","","","",""]
["2023-06-10","DU 5 AU 9 JUIN 2023","SAMEDI",null,"Dessert","45087Dessert","","","","","","","","","","","","","","","","","","","",""]
["2023-06-10","DU 5 AU 9 JUIN 2023","SAMEDI",null,"Dessert bis","45087Dessert bis","","","","","","","","","","","","","","","","","","","",""]
["2023-06-10","DU 5 AU 9 JUIN 2023","SAMEDI",null,"Alternative sans porc","45087Alternative sans porc","","","","","","","","","","","","","","","","","","","",""]
["2023-06-10","DU 5 AU 9 JUIN 2023","SAMEDI",null,"Alternative végétarien","45087Alternative végétarien","","","","","","","","","","","","","","","","","","","",""]
["2023-06-11","DU 5 AU 9 JUIN 2023","DIMANCHE",null,"Thème","45088Thème","","","","","","","","","","","","","","","","","","","",""]
["2023-06-11","DU 5 AU 9 JUIN 2023","DIMANCHE",null,"Entrée","45088Entrée","","","","","","","","","","","","","","","","","","","",""]
["2023-06-11","DU 5 AU 9 JUIN 2023","DIMANCHE",null,"Entrée bis","45088Entrée bis","","","","","","","","","","","","","","","","","","","",""]
["2023-06-11","DU 5 AU 9 JUIN 2023","DIMANCHE",null,"Plat","45088Plat","","","","","","","","","","","","","","","","","","","",""]
["2023-06-11","DU 5 AU 9 JUIN 2023","DIMANCHE",null,"Garniture","45088Garniture","","","","","","","","","","","","","","","","","","","",""]
["2023-06-11","DU 5 AU 9 JUIN 2023","DIMANCHE",null,"Fromage ou laitage","45088Fromage ou laitage","","","","","","","","","","","","","","","","","","","",""]
["2023-06-11","DU 5 AU 9 JUIN 2023","DIMANCHE",null,"Fromage ou laitage bis","45088Fromage ou laitage bis","","","","","","","","","","","","","","","","","","","",""]
["2023-06-11","DU 5 AU 9 JUIN 2023","DIMANCHE",null,"Dessert","45088Dessert","","","","","","","","","","","","","","","","","","","",""]
["2023-06-11","DU 5 AU 9 JUIN 2023","DIMANCHE",null,"Dessert bis","45088Dessert bis","","","","","","","","","","","","","","","","","","","",""]
["2023-06-11","DU 5 AU 9 JUIN 2023","DIMANCHE",null,"Alternative sans porc","45088Alternative sans porc","","","","","","","","","","","","","","","","","","","",""]
["2023-06-11","DU 5 AU 9 JUIN 2023","DIMANCHE",null,"Alternative végétarien","45088Alternative végétarien","","","","","","","","","","","","","","","","","","","",""]
["2023-06-12","DU 12 AU 16 JUIN 2023","LUNDI",null,"Thème","45089Thème","","","","","","","","","","","","","","","","","","","",""]
["2023-06-12","DU 12 AU 16 JUIN 2023","LUNDI","Salade californienne (Haricots rouges, maïs, poivrons, ananas)","Entrée","45089Entrée","Salade californienne (Haricots rouges, maïs, poivrons, ananas)","OK","","","","","","","","","x","x","","","","","Scolaires","Entrée","Féculents",""]
["2023-06-12","DU 12 AU 16 JUIN 2023","LUNDI",null,"Entrée bis","45089Entrée bis","","","","","","","","","","","","","","","","","","","",""]
["2023-06-12","DU 12 AU 16 JUIN 2023","LUNDI","Filet de lieu sauce blanche","Plat","45089Plat","Filet de lieu sauce blanche","OK","x","x","x","x","","x","x","","x","","","","","x","Crèche","Plat","Poisson",""]
["2023-06-12","DU 12 AU 16 JUIN 2023","LUNDI","Riz et haricots verts","Garniture","45089Garniture","Riz et haricots verts","OK","x","","x","","","","x","","x","","","","","","Scolaires","Garniture","Féculents / Légumes verts",""]
["2023-06-12","DU 12 AU 16 JUIN 2023","LUNDI","","Fromage ou laitage","45089Fromage ou laitage","","","","","","","","","","","","","","","","","","","",""]
["2023-06-12","DU 12 AU 16 JUIN 2023","LUNDI",null,"Fromage ou laitage bis","45089Fromage ou laitage bis","","","","","","","","","","","","","","","","","","","",""]
["2023-06-12","DU 12 AU 16 JUIN 2023","LUNDI","Fruit de saison BIO","Dessert","45089Dessert","Fruit de saison BIO","OK","","","","","","","","","","","","","","","Scolaires","Dessert BIO","Fruit cru ou cuit",""]
["2023-06-12","DU 12 AU 16 JUIN 2023","LUNDI",null,"Dessert bis","45089Dessert bis","","","","","","","","","","","","","","","","","","","",""]
["2023-06-12","DU 12 AU 16 JUIN 2023","LUNDI",null,"Alternative sans porc","45089Alternative sans porc","","","","","","","","","","","","","","","","","","","",""]
["2023-06-12","DU 12 AU 16 JUIN 2023","LUNDI","Palets de légumes montagnards, sauce blanche","Alternative végétarien","45089Alternative végétarien","Palets de légumes montagnards, sauce blanche","OK","x","x","x","x","x","x","x","x","x","x","x","x","x","x","","","",""]
["2023-06-13","DU 12 AU 16 JUIN 2023","MARDI","REPAS VEGETARIEN","Thème","45090Thème","REPAS VEGETARIEN","","","","","","","","","","","","","","","","","","",""]
["2023-06-13","DU 12 AU 16 JUIN 2023","MARDI","Salade verte","Entrée","45090Entrée","Salade verte","OK","","","","","","","","","x","x","","x","","","Scolaires","Entrée","Crudité",""]
["2023-06-13","DU 12 AU 16 JUIN 2023","MARDI",null,"Entrée bis","45090Entrée bis","","","","","","","","","","","","","","","","","","","",""]
["2023-06-13","DU 12 AU 16 JUIN 2023","MARDI","Tortellinis tomates mozarella BIO sauce basilic","Plat","45090Plat","Tortellinis tomates mozarella BIO sauce basilic","OK","x","","x","","","x","x","","","x","","","","","Scolaires","Plat BIO","Plat végétarien",""]
["2023-06-13","DU 12 AU 16 JUIN 2023","MARDI",null,"Garniture","45090Garniture","","","","","","","","","","","","","","","","","","","",""]
["2023-06-13","DU 12 AU 16 JUIN 2023","MARDI","","Fromage ou laitage","45090Fromage ou laitage","","","","","","","","","","","","","","","","","","","",""]
["2023-06-13","DU 12 AU 16 JUIN 2023","MARDI",null,"Fromage ou laitage bis","45090Fromage ou laitage bis","","","","","","","","","","","","","","","","","","","",""]
["2023-06-13","DU 12 AU 16 JUIN 2023","MARDI","Fruit de saison","Dessert","45090Dessert","Fruit de saison","OK","","","","","","","","","","","","","","","Scolaires","Dessert","Fruit cru ou cuit",""]
["2023-06-13","DU 12 AU 16 JUIN 2023","MARDI",null,"Dessert bis","45090Dessert bis","","","","","","","","","","","","","","","","","","","",""]
["2023-06-13","DU 12 AU 16 JUIN 2023","MARDI",null,"Alternative sans porc","45090Alternative sans porc","","","","","","","","","","","","","","","","","","","",""]
["2023-06-13","DU 12 AU 16 JUIN 2023","MARDI",null,"Alternative végétarien","45090Alternative végétarien","","","","","","","","","","","","","","","","","","","",""]
["2023-06-14","DU 12 AU 16 JUIN 2023","MERCREDI",null,"Thème","45091Thème","","","","","","","","","","","","","","","","","","","",""]
["2023-06-14","DU 12 AU 16 JUIN 2023","MERCREDI","","Entrée","45091Entrée","","","","","","","","","","","","","","","","","","","",""]
["2023-06-14","DU 12 AU 16 JUIN 2023","MERCREDI",null,"Entrée bis","45091Entrée bis","","","","","","","","","","","","","","","","","","","",""]
["2023-06-14","DU 12 AU 16 JUIN 2023","MERCREDI","Emincé de poulet à la crème","Plat","45091Plat","Emincé de poulet à la crème","OK","x","","","","","","x","","x","x","","x","","","Scolaires","Plat","Volaille",""]
["2023-06-14","DU 12 AU 16 JUIN 2023","MERCREDI","Purée pommes de terre","Garniture","45091Garniture","Purée pommes de terre","OK","","","","","","","x","","x","","","x","","","Crèche","Garniture","Purée de légumes et pommes de terre",""]
["2023-06-14","DU 12 AU 16 JUIN 2023","MERCREDI","Camembert","Fromage ou laitage","45091Fromage ou laitage","Camembert","OK","","","","","","","x","","","","","","","","Scolaires","Fromage et laitage","Fromages",""]
["2023-06-14","DU 12 AU 16 JUIN 2023","MERCREDI",null,"Fromage ou laitage bis","45091Fromage ou laitage bis","","","","","","","","","","","","","","","","","","","",""]
["2023-06-14","DU 12 AU 16 JUIN 2023","MERCREDI","Yaourt nature sucré BIO","Dessert","45091Dessert","Yaourt nature sucré BIO","OK","","","","","","","x","","","","","","","","Scolaires","Produits laitiers BIO","Laitage",""]
["2023-06-14","DU 12 AU 16 JUIN 2023","MERCREDI",null,"Dessert bis","45091Dessert bis","","","","","","","","","","","","","","","","","","","",""]
["2023-06-14","DU 12 AU 16 JUIN 2023","MERCREDI",null,"Alternative sans porc","45091Alternative sans porc","","","","","","","","","","","","","","","","","","","",""]
["2023-06-14","DU 12 AU 16 JUIN 2023","MERCREDI","Emincé végétal à la crème","Alternative végétarien","45091Alternative végétarien","Emincé végétal à la crème","OK","x","","x","","","x","x","","x","","x","","","","Scolaires","Plat","Végétarien",""]
["2023-06-15","DU 12 AU 16 JUIN 2023","JEUDI",null,"Thème","45092Thème","","","","","","","","","","","","","","","","","","","",""]
["2023-06-15","DU 12 AU 16 JUIN 2023","JEUDI","","Entrée","45092Entrée","","","","","","","","","","","","","","","","","","","",""]
["2023-06-15","DU 12 AU 16 JUIN 2023","JEUDI",null,"Entrée bis","45092Entrée bis","","","","","","","","","","","","","","","","","","","",""]
["2023-06-15","DU 12 AU 16 JUIN 2023","JEUDI","Goulash de bœuf","Plat","45092Plat","Goulash de bœuf","OK","x","","x","","","x","x","x","x","x","","x","","","Scolaires","Plat","Bœuf",""]
["2023-06-15","DU 12 AU 16 JUIN 2023","JEUDI","Semoule et carotte vichy","Garniture","45092Garniture","Semoule et carotte vichy","OK","x","","x","","","","x","","x","","","","","","Scolaires","Garniture","Féculents / Légumes verts",""]
["2023-06-15","DU 12 AU 16 JUIN 2023","JEUDI","Fripon","Fromage ou laitage","45092Fromage ou laitage","Fripon","OK","","","","","","","x","","","","","","","","Scolaires","Fromage et laitage","Fromages",""]
["2023-06-15","DU 12 AU 16 JUIN 2023","JEUDI",null,"Fromage ou laitage bis","45092Fromage ou laitage bis","","","","","","","","","","","","","","","","","","","",""]
["2023-06-15","DU 12 AU 16 JUIN 2023","JEUDI","Compote de fruits BIO","Dessert","45092Dessert","Compote de fruits BIO","OK","","","","","","","","","","","","","","","Scolaires","Dessert BIO","Fruit cru ou cuit",""]
["2023-06-15","DU 12 AU 16 JUIN 2023","JEUDI",null,"Dessert bis","45092Dessert bis","","","","","","","","","","","","","","","","","","","",""]
["2023-06-15","DU 12 AU 16 JUIN 2023","JEUDI",null,"Alternative sans porc","45092Alternative sans porc","","","","","","","","","","","","","","","","","","","",""]
["2023-06-15","DU 12 AU 16 JUIN 2023","JEUDI","Boulettes végétariennes","Alternative végétarien","45092Alternative végétarien","Boulettes végétariennes","OK","x","","x","x","","x","x","","x","","","x","","x","Scolaires","Plat","Végétarien",""]
["2023-06-16","DU 12 AU 16 JUIN 2023","VENDREDI",null,"Thème","45093Thème","","","","","","","","","","","","","","","","","","","",""]
["2023-06-16","DU 12 AU 16 JUIN 2023","VENDREDI","Salade de tomates BIO","Entrée","45093Entrée","Salade de tomates BIO","OK","","","","","","","","","x","x","","x","","","Scolaires","Entrée BIO","Crudité",""]
["2023-06-16","DU 12 AU 16 JUIN 2023","VENDREDI",null,"Entrée bis","45093Entrée bis","","","","","","","","","","","","","","","","","","","",""]
["2023-06-16","DU 12 AU 16 JUIN 2023","VENDREDI","Fricassé de volaille aux champignons","Plat","45093Plat","Fricassé de volaille aux champignons","OK","x","","x","","","","x","","x","x","","x","","","Scolaires","Plat","Volaille",""]
["2023-06-16","DU 12 AU 16 JUIN 2023","VENDREDI","Farfalles","Garniture","45093Garniture","Farfalles","OK","x","","x","","","","x","","x","","","","","","Scolaires","Garniture","Féculents / Légumes verts",""]
["2023-06-16","DU 12 AU 16 JUIN 2023","VENDREDI","","Fromage ou laitage","45093Fromage ou laitage","","","","","","","","","","","","","","","","","","","",""]
["2023-06-16","DU 12 AU 16 JUIN 2023","VENDREDI",null,"Fromage ou laitage bis","45093Fromage ou laitage bis","","","","","","","","","","","","","","","","","","","",""]
["2023-06-16","DU 12 AU 16 JUIN 2023","VENDREDI","Tarte au citron","Dessert","45093Dessert","Tarte au citron","OK","x","","x","","","x","x","x","","","","","","","Scolaires","Dessert","Pâtisserie",""]
["2023-06-16","DU 12 AU 16 JUIN 2023","VENDREDI",null,"Dessert bis","45093Dessert bis","","","","","","","","","","","","","","","","","","","",""]
["2023-06-16","DU 12 AU 16 JUIN 2023","VENDREDI",null,"Alternative sans porc","45093Alternative sans porc","","","","","","","","","","","","","","","","","","","",""]
["2023-06-16","DU 12 AU 16 JUIN 2023","VENDREDI","Fricassé de haricots blancs aux petits légumes","Alternative végétarien","45093Alternative végétarien","Fricassé de haricots blancs aux petits légumes","OK","x","","x","","x","x","x","x","x","x","x","","x","x","Scolaires","Garniture BIO","Féculents",""]
["2023-06-17","DU 12 AU 16 JUIN 2023","SAMEDI",null,"Thème","45094Thème","","","","","","","","","","","","","","","","","","","",""]
["2023-06-17","DU 12 AU 16 JUIN 2023","SAMEDI",null,"Entrée","45094Entrée","","","","","","","","","","","","","","","","","","","",""]
["2023-06-17","DU 12 AU 16 JUIN 2023","SAMEDI",null,"Entrée bis","45094Entrée bis","","","","","","","","","","","","","","","","","","","",""]
["2023-06-17","DU 12 AU 16 JUIN 2023","SAMEDI",null,"Plat","45094Plat","","","","","","","","","","","","","","","","","","","",""]
["2023-06-17","DU 12 AU 16 JUIN 2023","SAMEDI",null,"Garniture","45094Garniture","","","","","","","","","","","","","","","","","","","",""]
["2023-06-17","DU 12 AU 16 JUIN 2023","SAMEDI",null,"Fromage ou laitage","45094Fromage ou laitage","","","","","","","","","","","","","","","","","","","",""]
["2023-06-17","DU 12 AU 16 JUIN 2023","SAMEDI",null,"Fromage ou laitage bis","45094Fromage ou laitage bis","","","","","","","","","","","","","","","","","","","",""]
["2023-06-17","DU 12 AU 16 JUIN 2023","SAMEDI",null,"Dessert","45094Dessert","","","","","","","","","","","","","","","","","","","",""]
["2023-06-17","DU 12 AU 16 JUIN 2023","SAMEDI",null,"Dessert bis","45094Dessert bis","","","","","","","","","","","","","","","","","","","",""]
["2023-06-17","DU 12 AU 16 JUIN 2023","SAMEDI",null,"Alternative sans porc","45094Alternative sans porc","","","","","","","","","","","","","","","","","","","",""]
["2023-06-17","DU 12 AU 16 JUIN 2023","SAMEDI",null,"Alternative végétarien","45094Alternative végétarien","","","","","","","","","","","","","","","","","","","",""]
["2023-06-18","DU 12 AU 16 JUIN 2023","DIMANCHE",null,"Thème","45095Thème","","","","","","","","","","","","","","","","","","","",""]
["2023-06-18","DU 12 AU 16 JUIN 2023","DIMANCHE",null,"Entrée","45095Entrée","","","","","","","","","","","","","","","","","","","",""]
["2023-06-18","DU 12 AU 16 JUIN 2023","DIMANCHE",null,"Entrée bis","45095Entrée bis","","","","","","","","","","","","","","","","","","","",""]
["2023-06-18","DU 12 AU 16 JUIN 2023","DIMANCHE",null,"Plat","45095Plat","","","","","","","","","","","","","","","","","","","",""]
["2023-06-18","DU 12 AU 16 JUIN 2023","DIMANCHE",null,"Garniture","45095Garniture","","","","","","","","","","","","","","","","","","","",""]
["2023-06-18","DU 12 AU 16 JUIN 2023","DIMANCHE",null,"Fromage ou laitage","45095Fromage ou laitage","","","","","","","","","","","","","","","","","","","",""]
["2023-06-18","DU 12 AU 16 JUIN 2023","DIMANCHE",null,"Fromage ou laitage bis","45095Fromage ou laitage bis","","","","","","","","","","","","","","","","","","","",""]
["2023-06-18","DU 12 AU 16 JUIN 2023","DIMANCHE",null,"Dessert","45095Dessert","","","","","","","","","","","","","","","","","","","",""]
["2023-06-18","DU 12 AU 16 JUIN 2023","DIMANCHE",null,"Dessert bis","45095Dessert bis","","","","","","","","","","","","","","","","","","","",""]
["2023-06-18","DU 12 AU 16 JUIN 2023","DIMANCHE",null,"Alternative sans porc","45095Alternative sans porc","","","","","","","","","","","","","","","","","","","",""]
["2023-06-18","DU 12 AU 16 JUIN 2023","DIMANCHE",null,"Alternative végétarien","45095Alternative végétarien","","","","","","","","","","","","","","","","","","","",""]
["2023-06-19","DU 12 AU 16 JUIN 2023","LUNDI",null,"Thème","45096Thème","","","","","","","","","","","","","","","","","","","",""]
["2023-06-19","DU 12 AU 16 JUIN 2023","LUNDI","","Entrée","45096Entrée","","","","","","","","","","","","","","","","","","","",""]
["2023-06-19","DU 12 AU 16 JUIN 2023","LUNDI",null,"Entrée bis","45096Entrée bis","","","","","","","","","","","","","","","","","","","",""]
["2023-06-19","DU 12 AU 16 JUIN 2023","LUNDI","Filet de porc sauce dijonnaise","Plat","45096Plat","Filet de porc sauce dijonnaise","OK","x","","x","","","","x","x","x","x","","x","","","Scolaires","Plat","Porc",""]
["2023-06-19","DU 12 AU 16 JUIN 2023","LUNDI","Pommes de terre sautées","Garniture","45096Garniture","Pommes de terre sautées","OK","","","","","","","","","","","","","","","Scolaires","Garniture","Féculents",""]
["2023-06-19","DU 12 AU 16 JUIN 2023","LUNDI","Brie BIO à la coupe","Fromage ou laitage","45096Fromage ou laitage","Brie BIO à la coupe","OK","","","","","","","x","","","","","","","","Scolaires","Fromage et laitage","Fromages",""]
["2023-06-19","DU 12 AU 16 JUIN 2023","LUNDI",null,"Fromage ou laitage bis","45096Fromage ou laitage bis","","","","","","","","","","","","","","","","","","","",""]
["2023-06-19","DU 12 AU 16 JUIN 2023","LUNDI","Clafoutis à la cerise","Dessert","45096Dessert","Clafoutis à la cerise","OK","x","","x","","","x","x","x","","","","","","","Scolaires","Dessert","Pâtisserie",""]
["2023-06-19","DU 12 AU 16 JUIN 2023","LUNDI",null,"Dessert bis","45096Dessert bis","","","","","","","","","","","","","","","","","","","",""]
["2023-06-19","DU 12 AU 16 JUIN 2023","LUNDI","Filet de volaille sauce dijonnaise","Alternative sans porc","45096Alternative sans porc","Filet de volaille sauce dijonnaise","OK","x","","x","","","","x","","x","x","","","","","Scolaires","Plat","Volaille",""]
["2023-06-19","DU 12 AU 16 JUIN 2023","LUNDI","Palet végétal sauce dijonnaise","Alternative végétarien","45096Alternative végétarien","Palet végétal sauce dijonnaise","OK","x","","x","x","","x","x","x","x","x","x","","","","Scolaires","Plat","Végétarien",""]
["2023-06-20","DU 12 AU 16 JUIN 2023","MARDI",null,"Thème","45097Thème","","","","","","","","","","","","","","","","","","","",""]
["2023-06-20","DU 12 AU 16 JUIN 2023","MARDI","Crudités","Entrée","45097Entrée","Crudités","OK","","","","","","","","","x","x","","x","","","Scolaires","Entrée BIO","Crudité",""]
["2023-06-20","DU 12 AU 16 JUIN 2023","MARDI",null,"Entrée bis","45097Entrée bis","","","","","","","","","","","","","","","","","","","",""]
["2023-06-20","DU 12 AU 16 JUIN 2023","MARDI","Sauté de bœuf sauce charcutière","Plat","45097Plat","Sauté de bœuf sauce charcutière","OK","x","","x","","","x","x","","x","x","","x","","","Scolaires","Plat","Porc",""]
["2023-06-20","DU 12 AU 16 JUIN 2023","MARDI","Haricots plats et boulgour","Garniture","45097Garniture","Haricots plats et boulgour","OK","x","","x","","","","x","","x","","","","","","Scolaires","Garniture","Féculents / Légumes verts",""]
["2023-06-20","DU 12 AU 16 JUIN 2023","MARDI","","Fromage ou laitage","45097Fromage ou laitage","","","","","","","","","","","","","","","","","","","",""]
["2023-06-20","DU 12 AU 16 JUIN 2023","MARDI",null,"Fromage ou laitage bis","45097Fromage ou laitage bis","","","","","","","","","","","","","","","","","","","",""]
["2023-06-20","DU 12 AU 16 JUIN 2023","MARDI","Fruit de saison BIO","Dessert","45097Dessert","Fruit de saison BIO","OK","","","","","","","","","","","","","","","Scolaires","Dessert BIO","Fruit cru ou cuit",""]
["2023-06-20","DU 12 AU 16 JUIN 2023","MARDI",null,"Dessert bis","45097Dessert bis","","","","","","","","","","","","","","","","","","","",""]
["2023-06-20","DU 12 AU 16 JUIN 2023","MARDI",null,"Alternative sans porc","45097Alternative sans porc","","","","","","","","","","","","","","","","","","","",""]
["2023-06-20","DU 12 AU 16 JUIN 2023","MARDI","Œufs brouillés aux herbes","Alternative végétarien","45097Alternative végétarien","Œufs brouillés aux herbes","OK","","","x","","","","x","","","","","","","","Scolaires","Plat","Œuf",""]
["2023-06-21","DU 12 AU 16 JUIN 2023","MERCREDI",null,"Thème","45098Thème","","","","","","","","","","","","","","","","","","","",""]
["2023-06-21","DU 12 AU 16 JUIN 2023","MERCREDI","Salade de carottes BIO","Entrée","45098Entrée","Salade de carottes BIO","OK","","","","","","","","","x","x","","x","","","Scolaires","Entrée BIO","Crudité",""]
["2023-06-21","DU 12 AU 16 JUIN 2023","MERCREDI",null,"Entrée bis","45098Entrée bis","","","","","","","","","","","","","","","","","","","",""]
["2023-06-21","DU 12 AU 16 JUIN 2023","MERCREDI","Emincé de volaille à l'ancienne","Plat","45098Plat","Emincé de volaille à l'ancienne","OK","x","","x","","","","x","x","x","x","","x","","","Scolaires","Plat","Volaille",""]
["2023-06-21","DU 12 AU 16 JUIN 2023","MERCREDI","Coquillettes et courgettes sautées au thym","Garniture","45098Garniture","Coquillettes et courgettes sautées au thym","OK","x","","x","","","","x","","x","","","","","","Crèche","Garniture","Féculents / Légumes verts",""]
["2023-06-21","DU 12 AU 16 JUIN 2023","MERCREDI","","Fromage ou laitage","45098Fromage ou laitage","","","","","","","","","","","","","","","","","","","",""]
["2023-06-21","DU 12 AU 16 JUIN 2023","MERCREDI",null,"Fromage ou laitage bis","45098Fromage ou laitage bis","","","","","","","","","","","","","","","","","","","",""]
["2023-06-21","DU 12 AU 16 JUIN 2023","MERCREDI","Yaourt aux fruits","Dessert","45098Dessert","Yaourt aux fruits","OK","","","","","","","x","","","","","","","","Scolaires","Produits laitiers","Laitage",""]
["2023-06-21","DU 12 AU 16 JUIN 2023","MERCREDI",null,"Dessert bis","45098Dessert bis","","","","","","","","","","","","","","","","","","","",""]
["2023-06-21","DU 12 AU 16 JUIN 2023","MERCREDI",null,"Alternative sans porc","45098Alternative sans porc","","","","","","","","","","","","","","","","","","","",""]
["2023-06-21","DU 12 AU 16 JUIN 2023","MERCREDI","Quenelles sauce végétarienne","Alternative végétarien","45098Alternative végétarien","Quenelles sauce végétarienne","OK","x","x","x","x","x","x","x","x","x","x","x","x","x","x","","","",""]
["2023-06-22","DU 12 AU 16 JUIN 2023","JEUDI",null,"Thème","45099Thème","","","","","","","","","","","","","","","","","","","",""]
["2023-06-22","DU 12 AU 16 JUIN 2023","JEUDI","","Entrée","45099Entrée","","","","","","","","","","","","","","","","","","","",""]
["2023-06-22","DU 12 AU 16 JUIN 2023","JEUDI",null,"Entrée bis","45099Entrée bis","","","","","","","","","","","","","","","","","","","",""]
["2023-06-22","DU 12 AU 16 JUIN 2023","JEUDI","Colin meunière, citron","Plat","45099Plat","Colin meunière, citron","OK","x","x","x","x","","x","x","","x","x","","","","x","Scolaires","Plat","Poisson pané",""]
["2023-06-22","DU 12 AU 16 JUIN 2023","JEUDI","Purée de céleri BIO","Garniture","45099Garniture","Purée de céleri BIO","OK","","","","","","","","","x","","","","","","Crèche","Garniture","Purée 100% légumes verts",""]
["2023-06-22","DU 12 AU 16 JUIN 2023","JEUDI","Bleuet des prairies à la coupe","Fromage ou laitage","45099Fromage ou laitage","Bleuet des prairies à la coupe","OK","","","","","","","x","","","","","","","","Scolaires","Fromage et laitage","Fromages",""]
["2023-06-22","DU 12 AU 16 JUIN 2023","JEUDI",null,"Fromage ou laitage bis","45099Fromage ou laitage bis","","","","","","","","","","","","","","","","","","","",""]
["2023-06-22","DU 12 AU 16 JUIN 2023","JEUDI","Fruit de saison","Dessert","45099Dessert","Fruit de saison","OK","","","","","","","","","","","","","","","Scolaires","Dessert","Fruit cru ou cuit",""]
["2023-06-22","DU 12 AU 16 JUIN 2023","JEUDI",null,"Dessert bis","45099Dessert bis","","","","","","","","","","","","","","","","","","","",""]
["2023-06-22","DU 12 AU 16 JUIN 2023","JEUDI",null,"Alternative sans porc","45099Alternative sans porc","","","","","","","","","","","","","","","","","","","",""]
["2023-06-22","DU 12 AU 16 JUIN 2023","JEUDI","Nuggets de fromage","Alternative végétarien","45099Alternative végétarien","Nuggets de fromage","OK","","","","","","","","","","","","","","","Scolaires","Plat (brake)","Végétarien",""]
["2023-06-23","DU 12 AU 16 JUIN 2023","VENDREDI","REPAS VEGETARIEN","Thème","45100Thème","REPAS VEGETARIEN","","","","","","","","","","","","","","","","","","",""]
["2023-06-23","DU 12 AU 16 JUIN 2023","VENDREDI","Radis rouges émincés vinaigrette","Entrée","45100Entrée","Radis rouges émincés vinaigrette","OK","","","","","","","","","x","x","","x","","","Scolaires","Entrée","Crudité",""]
["2023-06-23","DU 12 AU 16 JUIN 2023","VENDREDI",null,"Entrée bis","45100Entrée bis","","","","","","","","","","","","","","","","","","","",""]
["2023-06-23","DU 12 AU 16 JUIN 2023","VENDREDI","Lasagnes","Plat","45100Plat","Lasagnes","OK","x","x","x","x","","x","x","x","x","x","x","","","x","Scolaires","Plat","Végétarien",""]
["2023-06-23","DU 12 AU 16 JUIN 2023","VENDREDI","épinards et chèvre","Garniture","45100Garniture","épinards et chèvre","OK","","","","","","","x","","","","","","","","Scolaires","Fromage et laitage","Fromages",""]
["2023-06-23","DU 12 AU 16 JUIN 2023","VENDREDI","","Fromage ou laitage","45100Fromage ou laitage","","","","","","","","","","","","","","","","","","","",""]
["2023-06-23","DU 12 AU 16 JUIN 2023","VENDREDI",null,"Fromage ou laitage bis","45100Fromage ou laitage bis","","","","","","","","","","","","","","","","","","","",""]
["2023-06-23","DU 12 AU 16 JUIN 2023","VENDREDI","Fruit de saison BIO","Dessert","45100Dessert","Fruit de saison BIO","OK","","","","","","","","","","","","","","","Scolaires","Dessert BIO","Fruit cru ou cuit",""]
["2023-06-23","DU 12 AU 16 JUIN 2023","VENDREDI",null,"Dessert bis","45100Dessert bis","","","","","","","","","","","","","","","","","","","",""]
["2023-06-23","DU 12 AU 16 JUIN 2023","VENDREDI",null,"Alternative sans porc","45100Alternative sans porc","","","","","","","","","","","","","","","","","","","",""]
["2023-06-23","DU 12 AU 16 JUIN 2023","VENDREDI",null,"Alternative végétarien","45100Alternative végétarien","","","","","","","","","","","","","","","","","","","",""]
["2023-06-24","DU 12 AU 16 JUIN 2023","SAMEDI",null,"Thème","45101Thème","","","","","","","","","","","","","","","","","","","",""]
["2023-06-24","DU 12 AU 16 JUIN 2023","SAMEDI",null,"Entrée","45101Entrée","","","","","","","","","","","","","","","","","","","",""]
["2023-06-24","DU 12 AU 16 JUIN 2023","SAMEDI",null,"Entrée bis","45101Entrée bis","","","","","","","","","","","","","","","","","","","",""]
["2023-06-24","DU 12 AU 16 JUIN 2023","SAMEDI",null,"Plat","45101Plat","","","","","","","","","","","","","","","","","","","",""]
["2023-06-24","DU 12 AU 16 JUIN 2023","SAMEDI",null,"Garniture","45101Garniture","","","","","","","","","","","","","","","","","","","",""]
["2023-06-24","DU 12 AU 16 JUIN 2023","SAMEDI",null,"Fromage ou laitage","45101Fromage ou laitage","","","","","","","","","","","","","","","","","","","",""]
["2023-06-24","DU 12 AU 16 JUIN 2023","SAMEDI",null,"Fromage ou laitage bis","45101Fromage ou laitage bis","","","","","","","","","","","","","","","","","","","",""]
["2023-06-24","DU 12 AU 16 JUIN 2023","SAMEDI",null,"Dessert","45101Dessert","","","","","","","","","","","","","","","","","","","",""]
["2023-06-24","DU 12 AU 16 JUIN 2023","SAMEDI",null,"Dessert bis","45101Dessert bis","","","","","","","","","","","","","","","","","","","",""]
["2023-06-24","DU 12 AU 16 JUIN 2023","SAMEDI",null,"Alternative sans porc","45101Alternative sans porc","","","","","","","","","","","","","","","","","","","",""]
["2023-06-24","DU 12 AU 16 JUIN 2023","SAMEDI",null,"Alternative végétarien","45101Alternative végétarien","","","","","","","","","","","","","","","","","","","",""]
["2023-06-25","DU 12 AU 16 JUIN 2023","DIMANCHE",null,"Thème","45102Thème","","","","","","","","","","","","","","","","","","","",""]
["2023-06-25","DU 12 AU 16 JUIN 2023","DIMANCHE",null,"Entrée","45102Entrée","","","","","","","","","","","","","","","","","","","",""]
["2023-06-25","DU 12 AU 16 JUIN 2023","DIMANCHE",null,"Entrée bis","45102Entrée bis","","","","","","","","","","","","","","","","","","","",""]
["2023-06-25","DU 12 AU 16 JUIN 2023","DIMANCHE",null,"Plat","45102Plat","","","","","","","","","","","","","","","","","","","",""]
["2023-06-25","DU 12 AU 16 JUIN 2023","DIMANCHE",null,"Garniture","45102Garniture","","","","","","","","","","","","","","","","","","","",""]
["2023-06-25","DU 12 AU 16 JUIN 2023","DIMANCHE",null,"Fromage ou laitage","45102Fromage ou laitage","","","","","","","","","","","","","","","","","","","",""]
["2023-06-25","DU 12 AU 16 JUIN 2023","DIMANCHE",null,"Fromage ou laitage bis","45102Fromage ou laitage bis","","","","","","","","","","","","","","","","","","","",""]
["2023-06-25","DU 12 AU 16 JUIN 2023","DIMANCHE",null,"Dessert","45102Dessert","","","","","","","","","","","","","","","","","","","",""]
["2023-06-25","DU 12 AU 16 JUIN 2023","DIMANCHE",null,"Dessert bis","45102Dessert bis","","","","","","","","","","","","","","","","","","","",""]
["2023-06-25","DU 12 AU 16 JUIN 2023","DIMANCHE",null,"Alternative sans porc","45102Alternative sans porc","","","","","","","","","","","","","","","","","","","",""]
["2023-06-25","DU 12 AU 16 JUIN 2023","DIMANCHE",null,"Alternative végétarien","45102Alternative végétarien","","","","","","","","","","","","","","","","","","","",""]
["2023-06-26","DU 26 AU 30 JUIN 2023","LUNDI",null,"Thème","45103Thème","","","","","","","","","","","","","","","","","","","",""]
["2023-06-26","DU 26 AU 30 JUIN 2023","LUNDI","","Entrée","45103Entrée","","","","","","","","","","","","","","","","","","","",""]
["2023-06-26","DU 26 AU 30 JUIN 2023","LUNDI",null,"Entrée bis","45103Entrée bis","","","","","","","","","","","","","","","","","","","",""]
["2023-06-26","DU 26 AU 30 JUIN 2023","LUNDI","Emincé de volaille sauce tomate","Plat","45103Plat","Emincé de volaille sauce tomate","OK","x","x","x","x","x","x","x","x","x","","","","","x","Scolaires","Plat BIO","Volaille",""]
["2023-06-26","DU 26 AU 30 JUIN 2023","LUNDI","Penne","Garniture","45103Garniture","Penne","OK","x","","x","","","","x","","x","","","","","","Scolaires","Garniture","Féculents / Légumes verts",""]
["2023-06-26","DU 26 AU 30 JUIN 2023","LUNDI","Fromage blanc sucré","Fromage ou laitage","45103Fromage ou laitage","Fromage blanc sucré","OK","","","","","","","x","","","","","","","","Scolaires","Produits laitiers","Laitage",""]
["2023-06-26","DU 26 AU 30 JUIN 2023","LUNDI",null,"Fromage ou laitage bis","45103Fromage ou laitage bis","","","","","","","","","","","","","","","","","","","",""]
["2023-06-26","DU 26 AU 30 JUIN 2023","LUNDI","Fruit de saison BIO","Dessert","45103Dessert","Fruit de saison BIO","OK","","","","","","","","","","","","","","","Scolaires","Dessert BIO","Fruit cru ou cuit",""]
["2023-06-26","DU 26 AU 30 JUIN 2023","LUNDI",null,"Dessert bis","45103Dessert bis","","","","","","","","","","","","","","","","","","","",""]
["2023-06-26","DU 26 AU 30 JUIN 2023","LUNDI",null,"Alternative sans porc","45103Alternative sans porc","","","","","","","","","","","","","","","","","","","",""]
["2023-06-26","DU 26 AU 30 JUIN 2023","LUNDI","Emincé végétal, sauce tomate","Alternative végétarien","45103Alternative végétarien","Emincé végétal, sauce tomate","OK","x","","x","","","x","x","","x","","x","","","","Scolaires","Plat","Végétarien",""]
["2023-06-27","DU 26 AU 30 JUIN 2023","MARDI",null,"Thème","45104Thème","","","","","","","","","","","","","","","","","","","",""]
["2023-06-27","DU 26 AU 30 JUIN 2023","MARDI","Salade de riz composée","Entrée","45104Entrée","Salade de riz composée","OK","","","","","","","x","","x","x","","x","","","Scolaires","Garniture","Salades et plats composés",""]
["2023-06-27","DU 26 AU 30 JUIN 2023","MARDI",null,"Entrée bis","45104Entrée bis","","","","","","","","","","","","","","","","","","","",""]
["2023-06-27","DU 26 AU 30 JUIN 2023","MARDI","Steack haché sauce brune","Plat","45104Plat","Steack haché sauce brune","OK","x","","x","","","","x","","x","x","","","","","Scolaires","Plat","Bœuf",""]
["2023-06-27","DU 26 AU 30 JUIN 2023","MARDI","Printannière de légumes","Garniture","45104Garniture","Printannière de légumes","OK","x","","x","","","","x","","x","","","","","","Scolaires","Garniture","Féculents / Légumes verts",""]
["2023-06-27","DU 26 AU 30 JUIN 2023","MARDI","","Fromage ou laitage","45104Fromage ou laitage","","","","","","","","","","","","","","","","","","","",""]
["2023-06-27","DU 26 AU 30 JUIN 2023","MARDI",null,"Fromage ou laitage bis","45104Fromage ou laitage bis","","","","","","","","","","","","","","","","","","","",""]
["2023-06-27","DU 26 AU 30 JUIN 2023","MARDI","Compote de fruits BIO","Dessert","45104Dessert","Compote de fruits BIO","OK","","","","","","","","","","","","","","","Scolaires","Dessert BIO","Fruit cru ou cuit",""]
["2023-06-27","DU 26 AU 30 JUIN 2023","MARDI",null,"Dessert bis","45104Dessert bis","","","","","","","","","","","","","","","","","","","",""]
["2023-06-27","DU 26 AU 30 JUIN 2023","MARDI",null,"Alternative sans porc","45104Alternative sans porc","","","","","","","","","","","","","","","","","","","",""]
["2023-06-27","DU 26 AU 30 JUIN 2023","MARDI","Crêpe aux champignons","Alternative végétarien","45104Alternative végétarien","Crêpe aux champignons","OK","x","","x","","","","x","","x","","","","","","Scolaires","Plat","Plat végétarien",""]
["2023-06-28","DU 26 AU 30 JUIN 2023","MERCREDI",null,"Thème","45105Thème","","","","","","","","","","","","","","","","","","","",""]
["2023-06-28","DU 26 AU 30 JUIN 2023","MERCREDI","","Entrée","45105Entrée","","","","","","","","","","","","","","","","","","","",""]
["2023-06-28","DU 26 AU 30 JUIN 2023","MERCREDI",null,"Entrée bis","45105Entrée bis","","","","","","","","","","","","","","","","","","","",""]
["2023-06-28","DU 26 AU 30 JUIN 2023","MERCREDI","Plein filet de hoki doré au beurre","Plat","45105Plat","Plein filet de hoki doré au beurre","OK","x","x","x","x","","x","x","","x","","","","","x","Scolaires","Plat","Poisson",""]
["2023-06-28","DU 26 AU 30 JUIN 2023","MERCREDI","Boulgour et épinards","Garniture","45105Garniture","Boulgour et épinards","OK","x","","x","","","","x","","x","","","","","","Scolaires","Garniture","Féculents / Légumes verts",""]
["2023-06-28","DU 26 AU 30 JUIN 2023","MERCREDI","Fromage BIO","Fromage ou laitage","45105Fromage ou laitage","Fromage BIO","OK","","","","","","","x","","","","","","","","Scolaires","Produits laitiers BIO","Fromage",""]
["2023-06-28","DU 26 AU 30 JUIN 2023","MERCREDI",null,"Fromage ou laitage bis","45105Fromage ou laitage bis","","","","","","","","","","","","","","","","","","","",""]
["2023-06-28","DU 26 AU 30 JUIN 2023","MERCREDI","Yaourt aux fruits","Dessert","45105Dessert","Yaourt aux fruits","OK","","","","","","","x","","","","","","","","Scolaires","Produits laitiers","Laitage",""]
["2023-06-28","DU 26 AU 30 JUIN 2023","MERCREDI",null,"Dessert bis","45105Dessert bis","","","","","","","","","","","","","","","","","","","",""]
["2023-06-28","DU 26 AU 30 JUIN 2023","MERCREDI",null,"Alternative sans porc","45105Alternative sans porc","","","","","","","","","","","","","","","","","","","",""]
["2023-06-28","DU 26 AU 30 JUIN 2023","MERCREDI","Quenelles natures BIO","Alternative végétarien","45105Alternative végétarien","Quenelles natures BIO","OK","x","","x","x","","","x","","","","","","","","Scolaires","Plat","Végétarien",""]
["2023-06-29","DU 26 AU 30 JUIN 2023","JEUDI","REPAS VEGETARIEN","Thème","45106Thème","REPAS VEGETARIEN","","","","","","","","","","","","","","","","","","",""]
["2023-06-29","DU 26 AU 30 JUIN 2023","JEUDI","Salade de courgettes râpées BIO","Entrée","45106Entrée","Salade de courgettes râpées BIO","OK","","","","","","","","","x","x","","x","","","Scolaires","Entrée BIO","Crudité",""]
["2023-06-29","DU 26 AU 30 JUIN 2023","JEUDI",null,"Entrée bis","45106Entrée bis","","","","","","","","","","","","","","","","","","","",""]
["2023-06-29","DU 26 AU 30 JUIN 2023","JEUDI","Œufs brouilles aux herbes","Plat","45106Plat","Œufs brouilles aux herbes","OK","","","x","","","","x","","","","","","","","Scolaires","Plat","Œuf",""]
["2023-06-29","DU 26 AU 30 JUIN 2023","JEUDI","Purée pommes de terre","Garniture","45106Garniture","Purée pommes de terre","OK","","","","","","","x","","x","","","x","","","Crèche","Garniture","Purée de légumes et pommes de terre",""]
["2023-06-29","DU 26 AU 30 JUIN 2023","JEUDI","","Fromage ou laitage","45106Fromage ou laitage","","","","","","","","","","","","","","","","","","","",""]
["2023-06-29","DU 26 AU 30 JUIN 2023","JEUDI",null,"Fromage ou laitage bis","45106Fromage ou laitage bis","","","","","","","","","","","","","","","","","","","",""]
["2023-06-29","DU 26 AU 30 JUIN 2023","JEUDI","Tarte au fromage blanc","Dessert","45106Dessert","Tarte au fromage blanc","OK","x","","x","","x","x","x","x","","","","","","","Scolaires","Dessert","Pâtisserie",""]
["2023-06-29","DU 26 AU 30 JUIN 2023","JEUDI",null,"Dessert bis","45106Dessert bis","","","","","","","","","","","","","","","","","","","",""]
["2023-06-29","DU 26 AU 30 JUIN 2023","JEUDI",null,"Alternative sans porc","45106Alternative sans porc","","","","","","","","","","","","","","","","","","","",""]
["2023-06-29","DU 26 AU 30 JUIN 2023","JEUDI",null,"Alternative végétarien","45106Alternative végétarien","","","","","","","","","","","","","","","","","","","",""]
["2023-06-30","DU 26 AU 30 JUIN 2023","VENDREDI",null,"Thème","45107Thème","","","","","","","","","","","","","","","","","","","",""]
["2023-06-30","DU 26 AU 30 JUIN 2023","VENDREDI","","Entrée","45107Entrée","","","","","","","","","","","","","","","","","","","",""]
["2023-06-30","DU 26 AU 30 JUIN 2023","VENDREDI",null,"Entrée bis","45107Entrée bis","","","","","","","","","","","","","","","","","","","",""]
["2023-06-30","DU 26 AU 30 JUIN 2023","VENDREDI","Côte cuite de porc","Plat","45107Plat","Côte cuite de porc","OK","x","","x","","","","x","x","x","x","","x","","","Crèche","Plat","Porc",""]
["2023-06-30","DU 26 AU 30 JUIN 2023","VENDREDI","Riz et carottes BIO au miel","Garniture","45107Garniture","Riz et carottes BIO au miel","OK","x","","x","","x","x","x","x","x","","","","","x","Crèche","Garniture BIO","Féculents / Légumes verts",""]
["2023-06-30","DU 26 AU 30 JUIN 2023","VENDREDI","Emmental","Fromage ou laitage","45107Fromage ou laitage","Emmental","OK","","","","","","","x","","","","","","","","Scolaires","Produits laitiers BIO","Fromage",""]
["2023-06-30","DU 26 AU 30 JUIN 2023","VENDREDI",null,"Fromage ou laitage bis","45107Fromage ou laitage bis","","","","","","","","","","","","","","","","","","","",""]
["2023-06-30","DU 26 AU 30 JUIN 2023","VENDREDI","Crème dessert saveur chocolat","Dessert","45107Dessert","Crème dessert saveur chocolat","OK","","","","","","x","x","","","","","","","","Scolaires","Produits laitiers","Laitage",""]
["2023-06-30","DU 26 AU 30 JUIN 2023","VENDREDI",null,"Dessert bis","45107Dessert bis","","","","","","","","","","","","","","","","","","","",""]
["2023-06-30","DU 26 AU 30 JUIN 2023","VENDREDI","Rôti de volaille","Alternative sans porc","45107Alternative sans porc","Rôti de volaille","OK","x","","x","","","","x","x","x","x","","x","","","Scolaires","Plat","Volaille",""]
["2023-06-30","DU 26 AU 30 JUIN 2023","VENDREDI","Risotto carottes et fèves","Alternative végétarien","45107Alternative végétarien","Risotto carottes et fèves","OK","x","","x","","","","x","x","x","x","","","","","Scolaires","Plat","Végétarien",""]
["2023-07-01","DU 26 AU 30 JUIN 2023","SAMEDI",null,"Thème","45108Thème","","","","","","","","","","","","","","","","","","","",""]
["2023-07-01","DU 26 AU 30 JUIN 2023","SAMEDI",null,"Entrée","45108Entrée","","","","","","","","","","","","","","","","","","","",""]
["2023-07-01","DU 26 AU 30 JUIN 2023","SAMEDI",null,"Entrée bis","45108Entrée bis","","","","","","","","","","","","","","","","","","","",""]
["2023-07-01","DU 26 AU 30 JUIN 2023","SAMEDI",null,"Plat","45108Plat","","","","","","","","","","","","","","","","","","","",""]
["2023-07-01","DU 26 AU 30 JUIN 2023","SAMEDI",null,"Garniture","45108Garniture","","","","","","","","","","","","","","","","","","","",""]
["2023-07-01","DU 26 AU 30 JUIN 2023","SAMEDI",null,"Fromage ou laitage","45108Fromage ou laitage","","","","","","","","","","","","","","","","","","","",""]
["2023-07-01","DU 26 AU 30 JUIN 2023","SAMEDI",null,"Fromage ou laitage bis","45108Fromage ou laitage bis","","","","","","","","","","","","","","","","","","","",""]
["2023-07-01","DU 26 AU 30 JUIN 2023","SAMEDI",null,"Dessert","45108Dessert","","","","","","","","","","","","","","","","","","","",""]
["2023-07-01","DU 26 AU 30 JUIN 2023","SAMEDI",null,"Dessert bis","45108Dessert bis","","","","","","","","","","","","","","","","","","","",""]
["2023-07-01","DU 26 AU 30 JUIN 2023","SAMEDI",null,"Alternative sans porc","45108Alternative sans porc","","","","","","","","","","","","","","","","","","","",""]
["2023-07-01","DU 26 AU 30 JUIN 2023","SAMEDI",null,"Alternative végétarien","45108Alternative végétarien","","","","","","","","","","","","","","","","","","","",""]
["2023-07-02","DU 26 AU 30 JUIN 2023","DIMANCHE",null,"Thème","45109Thème","","","","","","","","","","","","","","","","","","","",""]
["2023-07-02","DU 26 AU 30 JUIN 2023","DIMANCHE",null,"Entrée","45109Entrée","","","","","","","","","","","","","","","","","","","",""]
["2023-07-02","DU 26 AU 30 JUIN 2023","DIMANCHE",null,"Entrée bis","45109Entrée bis","","","","","","","","","","","","","","","","","","","",""]
["2023-07-02","DU 26 AU 30 JUIN 2023","DIMANCHE",null,"Plat","45109Plat","","","","","","","","","","","","","","","","","","","",""]
["2023-07-02","DU 26 AU 30 JUIN 2023","DIMANCHE",null,"Garniture","45109Garniture","","","","","","","","","","","","","","","","","","","",""]
["2023-07-02","DU 26 AU 30 JUIN 2023","DIMANCHE",null,"Fromage ou laitage","45109Fromage ou laitage","","","","","","","","","","","","","","","","","","","",""]
["2023-07-02","DU 26 AU 30 JUIN 2023","DIMANCHE",null,"Fromage ou laitage bis","45109Fromage ou laitage bis","","","","","","","","","","","","","","","","","","","",""]
["2023-07-02","DU 26 AU 30 JUIN 2023","DIMANCHE",null,"Dessert","45109Dessert","","","","","","","","","","","","","","","","","","","",""]
["2023-07-02","DU 26 AU 30 JUIN 2023","DIMANCHE",null,"Dessert bis","45109Dessert bis","","","","","","","","","","","","","","","","","","","",""]
["2023-07-02","DU 26 AU 30 JUIN 2023","DIMANCHE",null,"Alternative sans porc","45109Alternative sans porc","","","","","","","","","","","","","","","","","","","",""]
["2023-07-02","DU 26 AU 30 JUIN 2023","DIMANCHE",null,"Alternative végétarien","45109Alternative végétarien","","","","","","","","","","","","","","","","","","","",""]
["2023-07-03","DU 3 AU 7 JUILLET 2023","LUNDI","REPAS VEGETARIEN","Thème","45110Thème","REPAS VEGETARIEN","","","","","","","","","","","","","","","","","","",""]
["2023-07-03","DU 3 AU 7 JUILLET 2023","LUNDI","Salade de carottes BIO","Entrée","45110Entrée","Salade de carottes BIO","OK","","","","","","","","","x","x","","x","","","Scolaires","Entrée BIO","Crudité",""]
["2023-07-03","DU 3 AU 7 JUILLET 2023","LUNDI",null,"Entrée bis","45110Entrée bis","","","","","","","","","","","","","","","","","","","",""]
["2023-07-03","DU 3 AU 7 JUILLET 2023","LUNDI","Crispy d'or au fromage","Plat","45110Plat","Crispy d'or au fromage","OK","x","","x","","","x","x","x","","","","","","","Scolaires","Plat","Plat végétarien",""]
["2023-07-03","DU 3 AU 7 JUILLET 2023","LUNDI","Purée pommes de terre courgettes","Garniture","45110Garniture","Purée pommes de terre courgettes","OK","","","","","","","x","","x","","","x","","","Crèche","Garniture BIO","Purée de légumes et pommes de terre",""]
["2023-07-03","DU 3 AU 7 JUILLET 2023","LUNDI","","Fromage ou laitage","45110Fromage ou laitage","","","","","","","","","","","","","","","","","","","",""]
["2023-07-03","DU 3 AU 7 JUILLET 2023","LUNDI",null,"Fromage ou laitage bis","45110Fromage ou laitage bis","","","","","","","","","","","","","","","","","","","",""]
["2023-07-03","DU 3 AU 7 JUILLET 2023","LUNDI","Fruit de saison","Dessert","45110Dessert","Fruit de saison","OK","","","","","","","","","","","","","","","Scolaires","Dessert","Fruit cru ou cuit",""]
["2023-07-03","DU 3 AU 7 JUILLET 2023","LUNDI",null,"Dessert bis","45110Dessert bis","","","","","","","","","","","","","","","","","","","",""]
["2023-07-03","DU 3 AU 7 JUILLET 2023","LUNDI",null,"Alternative sans porc","45110Alternative sans porc","","","","","","","","","","","","","","","","","","","",""]
["2023-07-03","DU 3 AU 7 JUILLET 2023","LUNDI",null,"Alternative végétarien","45110Alternative végétarien","","","","","","","","","","","","","","","","","","","",""]
["2023-07-04","DU 3 AU 7 JUILLET 2023","MARDI","MENU DES ENFANTS","Thème","45111Thème","MENU DES ENFANTS","","","","","","","","","","","","","","","","","","",""]
["2023-07-04","DU 3 AU 7 JUILLET 2023","MARDI",null,"Entrée","45111Entrée","","","","","","","","","","","","","","","","","","","",""]
["2023-07-04","DU 3 AU 7 JUILLET 2023","MARDI",null,"Entrée bis","45111Entrée bis","","","","","","","","","","","","","","","","","","","",""]
["2023-07-04","DU 3 AU 7 JUILLET 2023","MARDI",null,"Plat","45111Plat","","","","","","","","","","","","","","","","","","","",""]
["2023-07-04","DU 3 AU 7 JUILLET 2023","MARDI",null,"Garniture","45111Garniture","","","","","","","","","","","","","","","","","","","",""]
["2023-07-04","DU 3 AU 7 JUILLET 2023","MARDI",null,"Fromage ou laitage","45111Fromage ou laitage","","","","","","","","","","","","","","","","","","","",""]
["2023-07-04","DU 3 AU 7 JUILLET 2023","MARDI",null,"Fromage ou laitage bis","45111Fromage ou laitage bis","","","","","","","","","","","","","","","","","","","",""]
["2023-07-04","DU 3 AU 7 JUILLET 2023","MARDI",null,"Dessert","45111Dessert","","","","","","","","","","","","","","","","","","","",""]
["2023-07-04","DU 3 AU 7 JUILLET 2023","MARDI",null,"Dessert bis","45111Dessert bis","","","","","","","","","","","","","","","","","","","",""]
["2023-07-04","DU 3 AU 7 JUILLET 2023","MARDI",null,"Alternative sans porc","45111Alternative sans porc","","","","","","","","","","","","","","","","","","","",""]
["2023-07-04","DU 3 AU 7 JUILLET 2023","MARDI",null,"Alternative végétarien","45111Alternative végétarien","","","","","","","","","","","","","","","","","","","",""]
["2023-07-05","DU 3 AU 7 JUILLET 2023","MERCREDI",null,"Thème","45112Thème","","","","","","","","","","","","","","","","","","","",""]
["2023-07-05","DU 3 AU 7 JUILLET 2023","MERCREDI","Salade de tomates","Entrée","45112Entrée","Salade de tomates","OK","","","","","","","","","x","x","","x","","","Scolaires","Entrée","Crudité",""]
["2023-07-05","DU 3 AU 7 JUILLET 2023","MERCREDI",null,"Entrée bis","45112Entrée bis","","","","","","","","","","","","","","","","","","","",""]
["2023-07-05","DU 3 AU 7 JUILLET 2023","MERCREDI","Carbonnade de bœuf","Plat","45112Plat","Carbonnade de bœuf","OK","x","","x","","","","x","x","x","x","","x","","","Scolaires","Plat","Bœuf",""]
["2023-07-05","DU 3 AU 7 JUILLET 2023","MERCREDI","Petits pois BIO aux petits oignons","Garniture","45112Garniture","Petits pois BIO aux petits oignons","OK","x","","x","","x","x","x","x","x","","","","","x","Scolaires","Garniture BIO","Légumes verts",""]
["2023-07-05","DU 3 AU 7 JUILLET 2023","MERCREDI","","Fromage ou laitage","45112Fromage ou laitage","","","","","","","","","","","","","","","","","","","",""]
["2023-07-05","DU 3 AU 7 JUILLET 2023","MERCREDI",null,"Fromage ou laitage bis","45112Fromage ou laitage bis","","","","","","","","","","","","","","","","","","","",""]
["2023-07-05","DU 3 AU 7 JUILLET 2023","MERCREDI","Fruit","Dessert","45112Dessert","Fruit","OK","","","","","","","","","","","","","","","Scolaires","Dessert","Fruit cru ou cuit",""]
["2023-07-05","DU 3 AU 7 JUILLET 2023","MERCREDI",null,"Dessert bis","45112Dessert bis","","","","","","","","","","","","","","","","","","","",""]
["2023-07-05","DU 3 AU 7 JUILLET 2023","MERCREDI",null,"Alternative sans porc","45112Alternative sans porc","","","","","","","","","","","","","","","","","","","",""]
["2023-07-05","DU 3 AU 7 JUILLET 2023","MERCREDI","Omelette au fromage","Alternative végétarien","45112Alternative végétarien","Omelette au fromage","OK","","","x","","","","x","","","","","","","","Scolaires","Plat","Végétarien",""]
["2023-07-06","DU 3 AU 7 JUILLET 2023","JEUDI",null,"Thème","45113Thème","","","","","","","","","","","","","","","","","","","",""]
["2023-07-06","DU 3 AU 7 JUILLET 2023","JEUDI","Salade de céleri BIO","Entrée","45113Entrée","Salade de céleri BIO","OK","","","","","","","","","x","x","","x","","","Scolaires","Entrée BIO","Crudité",""]
["2023-07-06","DU 3 AU 7 JUILLET 2023","JEUDI",null,"Entrée bis","45113Entrée bis","","","","","","","","","","","","","","","","","","","",""]
["2023-07-06","DU 3 AU 7 JUILLET 2023","JEUDI","Filet de colin sauce au curcuma","Plat","45113Plat","Filet de colin sauce au curcuma","OK","x","x","x","x","","x","x","","x","x","","x","","x","Scolaires","Plat","Poisson",""]
["2023-07-06","DU 3 AU 7 JUILLET 2023","JEUDI","Semoule et duo de haricots (verts et beurre)","Garniture","45113Garniture","Semoule et duo de haricots (verts et beurre)","OK","x","","x","","","","x","","x","","","","","","Scolaires","Garniture","Féculents / Légumes verts",""]
["2023-07-06","DU 3 AU 7 JUILLET 2023","JEUDI","","Fromage ou laitage","45113Fromage ou laitage","","","","","","","","","","","","","","","","","","","",""]
["2023-07-06","DU 3 AU 7 JUILLET 2023","JEUDI",null,"Fromage ou laitage bis","45113Fromage ou laitage bis","","","","","","","","","","","","","","","","","","","",""]
["2023-07-06","DU 3 AU 7 JUILLET 2023","JEUDI","Petit suisse sucré","Dessert","45113Dessert","Petit suisse sucré","OK","","","","","","","x","","","","","","","","Scolaires","Fromage et laitage","Laitage",""]
["2023-07-06","DU 3 AU 7 JUILLET 2023","JEUDI",null,"Dessert bis","45113Dessert bis","","","","","","","","","","","","","","","","","","","",""]
["2023-07-06","DU 3 AU 7 JUILLET 2023","JEUDI",null,"Alternative sans porc","45113Alternative sans porc","","","","","","","","","","","","","","","","","","","",""]
["2023-07-06","DU 3 AU 7 JUILLET 2023","JEUDI","Beignet de légumes","Alternative végétarien","45113Alternative végétarien","Beignet de légumes","OK","x","","x","","","","x","","x","x","","","","","Scolaires","Ganiture","Légumes verts",""]
["2023-07-07","DU 3 AU 7 JUILLET 2023","VENDREDI",null,"Thème","45114Thème","","","","","","","","","","","","","","","","","","","",""]
["2023-07-07","DU 3 AU 7 JUILLET 2023","VENDREDI","","Entrée","45114Entrée","","","","","","","","","","","","","","","","","","","",""]
["2023-07-07","DU 3 AU 7 JUILLET 2023","VENDREDI",null,"Entrée bis","45114Entrée bis","","","","","","","","","","","","","","","","","","","",""]
["2023-07-07","DU 3 AU 7 JUILLET 2023","VENDREDI","Emincé de volaille à la crème","Plat","45114Plat","Emincé de volaille à la crème","OK","x","","x","","","","x","","x","x","","x","","","Scolaires","Plat","Volaille",""]
["2023-07-07","DU 3 AU 7 JUILLET 2023","VENDREDI","Riz BIO","Garniture","45114Garniture","Riz BIO","OK","","","","","","","","","","","","","","","Scolaires","Garniture BIO","Féculents",""]
["2023-07-07","DU 3 AU 7 JUILLET 2023","VENDREDI","Fromage","Fromage ou laitage","45114Fromage ou laitage","Fromage","OK","","","","","","","x","","","","","","","","Scolaires","Produits laitiers BIO","Fromage",""]
["2023-07-07","DU 3 AU 7 JUILLET 2023","VENDREDI",null,"Fromage ou laitage bis","45114Fromage ou laitage bis","","","","","","","","","","","","","","","","","","","",""]
["2023-07-07","DU 3 AU 7 JUILLET 2023","VENDREDI","Compote","Dessert","45114Dessert","Compote","OK","","","","","","","","","","","","","","","Scolaires","Dessert","Fruit cru ou cuit",""]
["2023-07-07","DU 3 AU 7 JUILLET 2023","VENDREDI",null,"Dessert bis","45114Dessert bis","","","","","","","","","","","","","","","","","","","",""]
["2023-07-07","DU 3 AU 7 JUILLET 2023","VENDREDI",null,"Alternative sans porc","45114Alternative sans porc","","","","","","","","","","","","","","","","","","","",""]
["2023-07-07","DU 3 AU 7 JUILLET 2023","VENDREDI","Emincé végétal à la crème","Alternative végétarien","45114Alternative végétarien","Emincé végétal à la crème","OK","x","","x","","","x","x","","x","","x","","","","Scolaires","Plat","Végétarien",""]
["2023-07-08","DU 3 AU 7 JUILLET 2023","SAMEDI",null,"Thème","45115Thème","","","","","","","","","","","","","","","","","","","",""]
["2023-07-08","DU 3 AU 7 JUILLET 2023","SAMEDI",null,"Entrée","45115Entrée","","","","","","","","","","","","","","","","","","","",""]
["2023-07-08","DU 3 AU 7 JUILLET 2023","SAMEDI",null,"Entrée bis","45115Entrée bis","","","","","","","","","","","","","","","","","","","",""]
["2023-07-08","DU 3 AU 7 JUILLET 2023","SAMEDI",null,"Plat","45115Plat","","","","","","","","","","","","","","","","","","","",""]
["2023-07-08","DU 3 AU 7 JUILLET 2023","SAMEDI",null,"Garniture","45115Garniture","","","","","","","","","","","","","","","","","","","",""]
["2023-07-08","DU 3 AU 7 JUILLET 2023","SAMEDI",null,"Fromage ou laitage","45115Fromage ou laitage","","","","","","","","","","","","","","","","","","","",""]
["2023-07-08","DU 3 AU 7 JUILLET 2023","SAMEDI",null,"Fromage ou laitage bis","45115Fromage ou laitage bis","","","","","","","","","","","","","","","","","","","",""]
["2023-07-08","DU 3 AU 7 JUILLET 2023","SAMEDI",null,"Dessert","45115Dessert","","","","","","","","","","","","","","","","","","","",""]
["2023-07-08","DU 3 AU 7 JUILLET 2023","SAMEDI",null,"Dessert bis","45115Dessert bis","","","","","","","","","","","","","","","","","","","",""]
["2023-07-08","DU 3 AU 7 JUILLET 2023","SAMEDI",null,"Alternative sans porc","45115Alternative sans porc","","","","","","","","","","","","","","","","","","","",""]
["2023-07-08","DU 3 AU 7 JUILLET 2023","SAMEDI",null,"Alternative végétarien","45115Alternative végétarien","","","","","","","","","","","","","","","","","","","",""]
["2023-07-09","DU 3 AU 7 JUILLET 2023","DIMANCHE",null,"Thème","45116Thème","","","","","","","","","","","","","","","","","","","",""]
["2023-07-09","DU 3 AU 7 JUILLET 2023","DIMANCHE",null,"Entrée","45116Entrée","","","","","","","","","","","","","","","","","","","",""]
["2023-07-09","DU 3 AU 7 JUILLET 2023","DIMANCHE",null,"Entrée bis","45116Entrée bis","","","","","","","","","","","","","","","","","","","",""]
["2023-07-09","DU 3 AU 7 JUILLET 2023","DIMANCHE",null,"Plat","45116Plat","","","","","","","","","","","","","","","","","","","",""]
["2023-07-09","DU 3 AU 7 JUILLET 2023","DIMANCHE",null,"Garniture","45116Garniture","","","","","","","","","","","","","","","","","","","",""]
["2023-07-09","DU 3 AU 7 JUILLET 2023","DIMANCHE",null,"Fromage ou laitage","45116Fromage ou laitage","","","","","","","","","","","","","","","","","","","",""]
["2023-07-09","DU 3 AU 7 JUILLET 2023","DIMANCHE",null,"Fromage ou laitage bis","45116Fromage ou laitage bis","","","","","","","","","","","","","","","","","","","",""]
["2023-07-09","DU 3 AU 7 JUILLET 2023","DIMANCHE",null,"Dessert","45116Dessert","","","","","","","","","","","","","","","","","","","",""]
["2023-07-09","DU 3 AU 7 JUILLET 2023","DIMANCHE",null,"Dessert bis","45116Dessert bis","","","","","","","","","","","","","","","","","","","",""]
["2023-07-09","DU 3 AU 7 JUILLET 2023","DIMANCHE",null,"Alternative sans porc","45116Alternative sans porc","","","","","","","","","","","","","","","","","","","",""]
["2023-07-09","DU 3 AU 7 JUILLET 2023","DIMANCHE",null,"Alternative végétarien","45116Alternative végétarien","","","","","","","","","","","","","","","","","","","",""]
["2023-07-10",null,"LUNDI",null,"Thème","45117Thème","","","","","","","","","","","","","","","","","","","",""]
["2023-07-10",null,"LUNDI",null,"Entrée","45117Entrée","","","","","","","","","","","","","","","","","","","",""]
["2023-07-10",null,"LUNDI",null,"Entrée bis","45117Entrée bis","","","","","","","","","","","","","","","","","","","",""]
["2023-07-10",null,"LUNDI",null,"Plat","45117Plat","","","","","","","","","","","","","","","","","","","",""]
["2023-07-10",null,"LUNDI",null,"Garniture","45117Garniture","","","","","","","","","","","","","","","","","","","",""]
["2023-07-10",null,"LUNDI",null,"Fromage ou laitage","45117Fromage ou laitage","","","","","","","","","","","","","","","","","","","",""]
["2023-07-10",null,"LUNDI",null,"Fromage ou laitage bis","45117Fromage ou laitage bis","","","","","","","","","","","","","","","","","","","",""]
["2023-07-10",null,"LUNDI",null,"Dessert","45117Dessert","","","","","","","","","","","","","","","","","","","",""]
["2023-07-10",null,"LUNDI",null,"Dessert bis","45117Dessert bis","","","","","","","","","","","","","","","","","","","",""]
["2023-07-10",null,"LUNDI",null,"Alternative sans porc","45117Alternative sans porc","","","","","","","","","","","","","","","","","","","",""]
["2023-07-10",null,"LUNDI",null,"Alternative végétarien","45117Alternative végétarien","","","","","","","","","","","","","","","","","","","",""]
["2023-07-11",null,"MARDI",null,"Thème","45118Thème","","","","","","","","","","","","","","","","","","","",""]
["2023-07-11",null,"MARDI",null,"Entrée","45118Entrée","","","","","","","","","","","","","","","","","","","",""]
["2023-07-11",null,"MARDI",null,"Entrée bis","45118Entrée bis","","","","","","","","","","","","","","","","","","","",""]
["2023-07-11",null,"MARDI",null,"Plat","45118Plat","","","","","","","","","","","","","","","","","","","",""]
["2023-07-11",null,"MARDI",null,"Garniture","45118Garniture","","","","","","","","","","","","","","","","","","","",""]
["2023-07-11",null,"MARDI",null,"Fromage ou laitage","45118Fromage ou laitage","","","","","","","","","","","","","","","","","","","",""]
["2023-07-11",null,"MARDI",null,"Fromage ou laitage bis","45118Fromage ou laitage bis","","","","","","","","","","","","","","","","","","","",""]
["2023-07-11",null,"MARDI",null,"Dessert","45118Dessert","","","","","","","","","","","","","","","","","","","",""]
["2023-07-11",null,"MARDI",null,"Dessert bis","45118Dessert bis","","","","","","","","","","","","","","","","","","","",""]
["2023-07-11",null,"MARDI",null,"Alternative sans porc","45118Alternative sans porc","","","","","","","","","","","","","","","","","","","",""]
["2023-07-11",null,"MARDI",null,"Alternative végétarien","45118Alternative végétarien","","","","","","","","","","","","","","","","","","","",""]
["2023-07-12",null,"MERCREDI",null,"Thème","45119Thème","","","","","","","","","","","","","","","","","","","",""]
["2023-07-12",null,"MERCREDI",null,"Entrée","45119Entrée","","","","","","","","","","","","","","","","","","","",""]
["2023-07-12",null,"MERCREDI",null,"Entrée bis","45119Entrée bis","","","","","","","","","","","","","","","","","","","",""]
["2023-07-12",null,"MERCREDI",null,"Plat","45119Plat","","","","","","","","","","","","","","","","","","","",""]
["2023-07-12",null,"MERCREDI",null,"Garniture","45119Garniture","","","","","","","","","","","","","","","","","","","",""]
["2023-07-12",null,"MERCREDI",null,"Fromage ou laitage","45119Fromage ou laitage","","","","","","","","","","","","","","","","","","","",""]
["2023-07-12",null,"MERCREDI",null,"Fromage ou laitage bis","45119Fromage ou laitage bis","","","","","","","","","","","","","","","","","","","",""]
["2023-07-12",null,"MERCREDI",null,"Dessert","45119Dessert","","","","","","","","","","","","","","","","","","","",""]
["2023-07-12",null,"MERCREDI",null,"Dessert bis","45119Dessert bis","","","","","","","","","","","","","","","","","","","",""]
["2023-07-12",null,"MERCREDI",null,"Alternative sans porc","45119Alternative sans porc","","","","","","","","","","","","","","","","","","","",""]
["2023-07-12",null,"MERCREDI",null,"Alternative végétarien","45119Alternative végétarien","","","","","","","","","","","","","","","","","","","",""]
["2023-07-13",null,"JEUDI",null,"Thème","45120Thème","","","","","","","","","","","","","","","","","","","",""]
["2023-07-13",null,"JEUDI",null,"Entrée","45120Entrée","","","","","","","","","","","","","","","","","","","",""]
["2023-07-13",null,"JEUDI",null,"Entrée bis","45120Entrée bis","","","","","","","","","","","","","","","","","","","",""]
["2023-07-13",null,"JEUDI",null,"Plat","45120Plat","","","","","","","","","","","","","","","","","","","",""]
["2023-07-13",null,"JEUDI",null,"Garniture","45120Garniture","","","","","","","","","","","","","","","","","","","",""]
["2023-07-13",null,"JEUDI",null,"Fromage ou laitage","45120Fromage ou laitage","","","","","","","","","","","","","","","","","","","",""]
["2023-07-13",null,"JEUDI",null,"Fromage ou laitage bis","45120Fromage ou laitage bis","","","","","","","","","","","","","","","","","","","",""]
["2023-07-13",null,"JEUDI",null,"Dessert","45120Dessert","","","","","","","","","","","","","","","","","","","",""]
["2023-07-13",null,"JEUDI",null,"Dessert bis","45120Dessert bis","","","","","","","","","","","","","","","","","","","",""]
["2023-07-13",null,"JEUDI",null,"Alternative sans porc","45120Alternative sans porc","","","","","","","","","","","","","","","","","","","",""]
["2023-07-13",null,"JEUDI",null,"Alternative végétarien","45120Alternative végétarien","","","","","","","","","","","","","","","","","","","",""]
["2023-07-14",null,"VENDREDI",null,"Thème","45121Thème","","","","","","","","","","","","","","","","","","","",""]
["2023-07-14",null,"VENDREDI",null,"Entrée","45121Entrée","","","","","","","","","","","","","","","","","","","",""]
["2023-07-14",null,"VENDREDI",null,"Entrée bis","45121Entrée bis","","","","","","","","","","","","","","","","","","","",""]
["2023-07-14",null,"VENDREDI",null,"Plat","45121Plat","","","","","","","","","","","","","","","","","","","",""]
["2023-07-14",null,"VENDREDI",null,"Garniture","45121Garniture","","","","","","","","","","","","","","","","","","","",""]
["2023-07-14",null,"VENDREDI",null,"Fromage ou laitage","45121Fromage ou laitage","","","","","","","","","","","","","","","","","","","",""]
["2023-07-14",null,"VENDREDI",null,"Fromage ou laitage bis","45121Fromage ou laitage bis","","","","","","","","","","","","","","","","","","","",""]
["2023-07-14",null,"VENDREDI",null,"Dessert","45121Dessert","","","","","","","","","","","","","","","","","","","",""]
["2023-07-14",null,"VENDREDI",null,"Dessert bis","45121Dessert bis","","","","","","","","","","","","","","","","","","","",""]
["2023-07-14",null,"VENDREDI",null,"Alternative sans porc","45121Alternative sans porc","","","","","","","","","","","","","","","","","","","",""]
["2023-07-14",null,"VENDREDI",null,"Alternative végétarien","45121Alternative végétarien","","","","","","","","","","","","","","","","","","","",""]
["2023-07-15",null,"SAMEDI",null,"Thème","45122Thème","","","","","","","","","","","","","","","","","","","",""]
["2023-07-15",null,"SAMEDI",null,"Entrée","45122Entrée","","","","","","","","","","","","","","","","","","","",""]
["2023-07-15",null,"SAMEDI",null,"Entrée bis","45122Entrée bis","","","","","","","","","","","","","","","","","","","",""]
["2023-07-15",null,"SAMEDI",null,"Plat","45122Plat","","","","","","","","","","","","","","","","","","","",""]
["2023-07-15",null,"SAMEDI",null,"Garniture","45122Garniture","","","","","","","","","","","","","","","","","","","",""]
["2023-07-15",null,"SAMEDI",null,"Fromage ou laitage","45122Fromage ou laitage","","","","","","","","","","","","","","","","","","","",""]
["2023-07-15",null,"SAMEDI",null,"Fromage ou laitage bis","45122Fromage ou laitage bis","","","","","","","","","","","","","","","","","","","",""]
["2023-07-15",null,"SAMEDI",null,"Dessert","45122Dessert","","","","","","","","","","","","","","","","","","","",""]
["2023-07-15",null,"SAMEDI",null,"Dessert bis","45122Dessert bis","","","","","","","","","","","","","","","","","","","",""]
["2023-07-15",null,"SAMEDI",null,"Alternative sans porc","45122Alternative sans porc","","","","","","","","","","","","","","","","","","","",""]
["2023-07-15",null,"SAMEDI",null,"Alternative végétarien","45122Alternative végétarien","","","","","","","","","","","","","","","","","","","",""]
["2023-07-16",null,"DIMANCHE",null,"Thème","45123Thème","","","","","","","","","","","","","","","","","","","",""]
["2023-07-16",null,"DIMANCHE",null,"Entrée","45123Entrée","","","","","","","","","","","","","","","","","","","",""]
["2023-07-16",null,"DIMANCHE",null,"Entrée bis","45123Entrée bis","","","","","","","","","","","","","","","","","","","",""]
["2023-07-16",null,"DIMANCHE",null,"Plat","45123Plat","","","","","","","","","","","","","","","","","","","",""]
["2023-07-16",null,"DIMANCHE",null,"Garniture","45123Garniture","","","","","","","","","","","","","","","","","","","",""]
["2023-07-16",null,"DIMANCHE",null,"Fromage ou laitage","45123Fromage ou laitage","","","","","","","","","","","","","","","","","","","",""]
["2023-07-16",null,"DIMANCHE",null,"Fromage ou laitage bis","45123Fromage ou laitage bis","","","","","","","","","","","","","","","","","","","",""]
["2023-07-16",null,"DIMANCHE",null,"Dessert","45123Dessert","","","","","","","","","","","","","","","","","","","",""]
["2023-07-16",null,"DIMANCHE",null,"Dessert bis","45123Dessert bis","","","","","","","","","","","","","","","","","","","",""]
["2023-07-16",null,"DIMANCHE",null,"Alternative sans porc","45123Alternative sans porc","","","","","","","","","","","","","","","","","","","",""]
["2023-07-16",null,"DIMANCHE",null,"Alternative végétarien","45123Alternative végétarien","","","","","","","","","","","","","","","","","","","",""]

{"sheet":"Allergènes du jour","index":2,"n_rows":26,"n_cols":15,"rows_kept":26,"cut":false,"hidden":false,"merged":[[6,13,8,13],[6,14,8,14],[1,9,1,11],[1,12,1,14],[1,0,1,2],[4,0,6,0],[0,0,0,14],[6,1,8,1],[6,2,8,2],[6,3,8,3],[6,4,8,4],[6,5,8,5],[6,6,8,6],[6,7,8,7],[6,8,8,8],[6,9,8,9],[6,10,8,10],[6,11,8,11],[6,12,8,12]]}
["FICHE DE SUIVI DES ALLERGENES*"]
["Client : WOLFISHEIM",null,null,null,null,null,"MENU SANS CHOIX",null,null,"DATE DE CONSOMMATION :",null,null,"2023-05-09"]
[]
["* L'information ne fait pas état des éventuelles contaminations croisées pouvant survenir au moment de la préparation des repas ou ensuite au moment du service."]
[]
[null,4,5,6,7,8,9,10,11,12,13,14,15,16,17]
[null,"Céréales contenant du gluten","Crustacés et produits    à base de crustacés","Oeufs          et produits à base d'oeufs","Poissons     et produits à base de poissons","Arachide            et produits à base d'arachide","Soja et produits à base de soja","Lait  et produits à base de lait (y compris le lactose)","Fruits à coque et produits à base de ces fruits","Céleri et produits à base de céleri","Moutarde           et produits à base de moutarde","Graines de sésame        et produits à base de graines de sésame","Anhydride sulfureux         et       sulfites","Lupin           et produits à base de lupin","Mollusques et produits à base de mollusques"]
["Thème"]
[{"$f":"IF(ISNA(VLOOKUP(CONCATENATE($M$2&A8),Outils!$F:$S,2,FALSE)),\"\",VLOOKUP(CONCATENATE($M$2&A8),Outils!$F:$S,2,FALSE))","v":""}]
["Entrée"]
[{"$f":"IF(ISNA(VLOOKUP(CONCATENATE($M$2&A10),Outils!$F:$S,2,FALSE)),\"\",VLOOKUP(CONCATENATE($M$2&A10),Outils!$F:$S,2,FALSE))","v":"Salade de chou rouge"},{"$f":"IF($A11<>\"\",VLOOKUP(CONCATENATE($M$2&$A10),Outils!$F:$V,B$6,FALSE),\"\")","v":""},{"$f":"IF($A11<>\"\",VLOOKUP(CONCATENATE($M$2&$A10),Outils!$F:$V,C$6,FALSE),\"\")","v":""},{"$f":"IF($A11<>\"\",VLOOKUP(CONCATENATE($M$2&$A10),Outils!$F:$V,D$6,FALSE),\"\")","v":""},{"$f":"IF($A11<>\"\",VLOOKUP(CONCATENATE($M$2&$A10),Outils!$F:$V,E$6,FALSE),\"\")","v":""},{"$f":"IF($A11<>\"\",VLOOKUP(CONCATENATE($M$2&$A10),Outils!$F:$V,F$6,FALSE),\"\")","v":""},{"$f":"IF($A11<>\"\",VLOOKUP(CONCATENATE($M$2&$A10),Outils!$F:$V,G$6,FALSE),\"\")","v":""},{"$f":"IF($A11<>\"\",VLOOKUP(CONCATENATE($M$2&$A10),Outils!$F:$V,H$6,FALSE),\"\")","v":""},{"$f":"IF($A11<>\"\",VLOOKUP(CONCATENATE($M$2&$A10),Outils!$F:$V,I$6,FALSE),\"\")","v":""},{"$f":"IF($A11<>\"\",VLOOKUP(CONCATENATE($M$2&$A10),Outils!$F:$V,J$6,FALSE),\"\")","v":"x"},{"$f":"IF($A11<>\"\",VLOOKUP(CONCATENATE($M$2&$A10),Outils!$F:$V,K$6,FALSE),\"\")","v":"x"},{"$f":"IF($A11<>\"\",VLOOKUP(CONCATENATE($M$2&$A10),Outils!$F:$V,L$6,FALSE),\"\")","v":""},{"$f":"IF($A11<>\"\",VLOOKUP(CONCATENATE($M$2&$A10),Outils!$F:$V,M$6,FALSE),\"\")","v":"x"},{"$f":"IF($A11<>\"\",VLOOKUP(CONCATENATE($M$2&$A10),Outils!$F:$V,N$6,FALSE),\"\")","v":""},{"$f":"IF($A11<>\"\",VLOOKUP(CONCATENATE($M$2&$A10),Outils!$F:$V,O$6,FALSE),\"\")","v":""}]
[{"$f":"IF(ISNA(VLOOKUP(CONCATENATE($M$2&A10&\" bis\"),Outils!$F:$S,2,FALSE)),\"\",VLOOKUP(CONCATENATE($M$2&A10&\" bis\"),Outils!$F:$S,2,FALSE))","v":""},{"$f":"IF($A12<>\"\",VLOOKUP(CONCATENATE($M$2&$A10&\" bis\"),Outils!$F:$V,B$6,FALSE),\"\")","v":""},{"$f":"IF($A12<>\"\",VLOOKUP(CONCATENATE($M$2&$A10&\" bis\"),Outils!$F:$V,C$6,FALSE),\"\")","v":""},{"$f":"IF($A12<>\"\",VLOOKUP(CONCATENATE($M$2&$A10&\" bis\"),Outils!$F:$V,D$6,FALSE),\"\")","v":""},{"$f":"IF($A12<>\"\",VLOOKUP(CONCATENATE($M$2&$A10&\" bis\"),Outils!$F:$V,E$6,FALSE),\"\")","v":""},{"$f":"IF($A12<>\"\",VLOOKUP(CONCATENATE($M$2&$A10&\" bis\"),Outils!$F:$V,F$6,FALSE),\"\")","v":""},{"$f":"IF($A12<>\"\",VLOOKUP(CONCATENATE($M$2&$A10&\" bis\"),Outils!$F:$V,G$6,FALSE),\"\")","v":""},{"$f":"IF($A12<>\"\",VLOOKUP(CONCATENATE($M$2&$A10&\" bis\"),Outils!$F:$V,H$6,FALSE),\"\")","v":""},{"$f":"IF($A12<>\"\",VLOOKUP(CONCATENATE($M$2&$A10&\" bis\"),Outils!$F:$V,I$6,FALSE),\"\")","v":""},{"$f":"IF($A12<>\"\",VLOOKUP(CONCATENATE($M$2&$A10&\" bis\"),Outils!$F:$V,J$6,FALSE),\"\")","v":""},{"$f":"IF($A12<>\"\",VLOOKUP(CONCATENATE($M$2&$A10&\" bis\"),Outils!$F:$V,K$6,FALSE),\"\")","v":""},{"$f":"IF($A12<>\"\",VLOOKUP(CONCATENATE($M$2&$A10&\" bis\"),Outils!$F:$V,L$6,FALSE),\"\")","v":""},{"$f":"IF($A12<>\"\",VLOOKUP(CONCATENATE($M$2&$A10&\" bis\"),Outils!$F:$V,M$6,FALSE),\"\")","v":""},{"$f":"IF($A12<>\"\",VLOOKUP(CONCATENATE($M$2&$A10&\" bis\"),Outils!$F:$V,N$6,FALSE),\"\")","v":""},{"$f":"IF($A12<>\"\",VLOOKUP(CONCATENATE($M$2&$A10&\" bis\"),Outils!$F:$V,O$6,FALSE),\"\")","v":""}]
["Plat"]
[{"$f":"IF(ISNA(VLOOKUP(CONCATENATE($M$2&A13),Outils!$F:$S,2,FALSE)),\"\",VLOOKUP(CONCATENATE($M$2&A13),Outils!$F:$S,2,FALSE))","v":"Cassolette de colin d'Alaska"},{"$f":"IF($A14<>\"\",VLOOKUP(CONCATENATE($M$2&$A13),Outils!$F:$V,B$6,FALSE),\"\")","v":"x"},{"$f":"IF($A14<>\"\",VLOOKUP(CONCATENATE($M$2&$A13),Outils!$F:$V,C$6,FALSE),\"\")","v":"x"},{"$f":"IF($A14<>\"\",VLOOKUP(CONCATENATE($M$2&$A13),Outils!$F:$V,D$6,FALSE),\"\")","v":"x"},{"$f":"IF($A14<>\"\",VLOOKUP(CONCATENATE($M$2&$A13),Outils!$F:$V,E$6,FALSE),\"\")","v":"x"},{"$f":"IF($A14<>\"\",VLOOKUP(CONCATENATE($M$2&$A13),Outils!$F:$V,F$6,FALSE),\"\")","v":""},{"$f":"IF($A14<>\"\",VLOOKUP(CONCATENATE($M$2&$A13),Outils!$F:$V,G$6,FALSE),\"\")","v":"x"},{"$f":"IF($A14<>\"\",VLOOKUP(CONCATENATE($M$2&$A13),Outils!$F:$V,H$6,FALSE),\"\")","v":"x"},{"$f":"IF($A14<>\"\",VLOOKUP(CONCATENATE($M$2&$A13),Outils!$F:$V,I$6,FALSE),\"\")","v":""},{"$f":"IF($A14<>\"\",VLOOKUP(CONCATENATE($M$2&$A13),Outils!$F:$V,J$6,FALSE),\"\")","v":"x"},{"$f":"IF($A14<>\"\",VLOOKUP(CONCATENATE($M$2&$A13),Outils!$F:$V,K$6,FALSE),\"\")","v":""},{"$f":"IF($A14<>\"\",VLOOKUP(CONCATENATE($M$2&$A13),Outils!$F:$V,L$6,FALSE),\"\")","v":""},{"$f":"IF($A14<>\"\",VLOOKUP(CONCATENATE($M$2&$A13),Outils!$F:$V,M$6,FALSE),\"\")","v":""},{"$f":"IF($A14<>\"\",VLOOKUP(CONCATENATE($M$2&$A13),Outils!$F:$V,N$6,FALSE),\"\")","v":""},{"$f":"IF($A14<>\"\",VLOOKUP(CONCATENATE($M$2&$A13),Outils!$F:$V,O$6,FALSE),\"\")","v":"x"}]
["Garniture"]
[{"$f":"IF(ISNA(VLOOKUP(CONCATENATE($M$2&A15),Outils!$F:$S,2,FALSE)),\"\",VLOOKUP(CONCATENATE($M$2&A15),Outils!$F:$S,2,FALSE))","v":"Riz BIO"},{"$f":"IF($A16<>\"\",VLOOKUP(CONCATENATE($M$2&$A15),Outils!$F:$V,B$6,FALSE),\"\")","v":""},{"$f":"IF($A16<>\"\",VLOOKUP(CONCATENATE($M$2&$A15),Outils!$F:$V,C$6,FALSE),\"\")","v":""},{"$f":"IF($A16<>\"\",VLOOKUP(CONCATENATE($M$2&$A15),Outils!$F:$V,D$6,FALSE),\"\")","v":""},{"$f":"IF($A16<>\"\",VLOOKUP(CONCATENATE($M$2&$A15),Outils!$F:$V,E$6,FALSE),\"\")","v":""},{"$f":"IF($A16<>\"\",VLOOKUP(CONCATENATE($M$2&$A15),Outils!$F:$V,F$6,FALSE),\"\")","v":""},{"$f":"IF($A16<>\"\",VLOOKUP(CONCATENATE($M$2&$A15),Outils!$F:$V,G$6,FALSE),\"\")","v":""},{"$f":"IF($A16<>\"\",VLOOKUP(CONCATENATE($M$2&$A15),Outils!$F:$V,H$6,FALSE),\"\")","v":""},{"$f":"IF($A16<>\"\",VLOOKUP(CONCATENATE($M$2&$A15),Outils!$F:$V,I$6,FALSE),\"\")","v":""},{"$f":"IF($A16<>\"\",VLOOKUP(CONCATENATE($M$2&$A15),Outils!$F:$V,J$6,FALSE),\"\")","v":""},{"$f":"IF($A16<>\"\",VLOOKUP(CONCATENATE($M$2&$A15),Outils!$F:$V,K$6,FALSE),\"\")","v":""},{"$f":"IF($A16<>\"\",VLOOKUP(CONCATENATE($M$2&$A15),Outils!$F:$V,L$6,FALSE),\"\")","v":""},{"$f":"IF($A16<>\"\",VLOOKUP(CONCATENATE($M$2&$A15),Outils!$F:$V,M$6,FALSE),\"\")","v":""},{"$f":"IF($A16<>\"\",VLOOKUP(CONCATENATE($M$2&$A15),Outils!$F:$V,N$6,FALSE),\"\")","v":""},{"$f":"IF($A16<>\"\",VLOOKUP(CONCATENATE($M$2&$A15),Outils!$F:$V,O$6,FALSE),\"\")","v":""}]
["Fromage ou laitage"]
[{"$f":"IF(ISNA(VLOOKUP(CONCATENATE($M$2&A17),Outils!$F:$S,2,FALSE)),\"\",VLOOKUP(CONCATENATE($M$2&A17),Outils!$F:$S,2,FALSE))","v":""},{"$f":"IF($A18<>\"\",VLOOKUP(CONCATENATE($M$2&$A17),Outils!$F:$V,B$6,FALSE),\"\")","v":""},{"$f":"IF($A18<>\"\",VLOOKUP(CONCATENATE($M$2&$A17),Outils!$F:$V,C$6,FALSE),\"\")","v":""},{"$f":"IF($A18<>\"\",VLOOKUP(CONCATENATE($M$2&$A17),Outils!$F:$V,D$6,FALSE),\"\")","v":""},{"$f":"IF($A18<>\"\",VLOOKUP(CONCATENATE($M$2&$A17),Outils!$F:$V,E$6,FALSE),\"\")","v":""},{"$f":"IF($A18<>\"\",VLOOKUP(CONCATENATE($M$2&$A17),Outils!$F:$V,F$6,FALSE),\"\")","v":""},{"$f":"IF($A18<>\"\",VLOOKUP(CONCATENATE($M$2&$A17),Outils!$F:$V,G$6,FALSE),\"\")","v":""},{"$f":"IF($A18<>\"\",VLOOKUP(CONCATENATE($M$2&$A17),Outils!$F:$V,H$6,FALSE),\"\")","v":""},{"$f":"IF($A18<>\"\",VLOOKUP(CONCATENATE($M$2&$A17),Outils!$F:$V,I$6,FALSE),\"\")","v":""},{"$f":"IF($A18<>\"\",VLOOKUP(CONCATENATE($M$2&$A17),Outils!$F:$V,J$6,FALSE),\"\")","v":""},{"$f":"IF($A18<>\"\",VLOOKUP(CONCATENATE($M$2&$A17),Outils!$F:$V,K$6,FALSE),\"\")","v":""},{"$f":"IF($A18<>\"\",VLOOKUP(CONCATENATE($M$2&$A17),Outils!$F:$V,L$6,FALSE),\"\")","v":""},{"$f":"IF($A18<>\"\",VLOOKUP(CONCATENATE($M$2&$A17),Outils!$F:$V,M$6,FALSE),\"\")","v":""},{"$f":"IF($A18<>\"\",VLOOKUP(CONCATENATE($M$2&$A17),Outils!$F:$V,N$6,FALSE),\"\")","v":""},{"$f":"IF($A18<>\"\",VLOOKUP(CONCATENATE($M$2&$A17),Outils!$F:$V,O$6,FALSE),\"\")","v":""}]
[{"$f":"IF(ISNA(VLOOKUP(CONCATENATE($M$2&A17&\" bis\"),Outils!$F:$S,2,FALSE)),\"\",VLOOKUP(CONCATENATE($M$2&A17&\" bis\"),Outils!$F:$S,2,FALSE))","v":""},{"$f":"IF($A19<>\"\",VLOOKUP(CONCATENATE($M$2&$A17&\" bis\"),Outils!$F:$V,B$6,FALSE),\"\")","v":""},{"$f":"IF($A19<>\"\",VLOOKUP(CONCATENATE($M$2&$A17&\" bis\"),Outils!$F:$V,C$6,FALSE),\"\")","v":""},{"$f":"IF($A19<>\"\",VLOOKUP(CONCATENATE($M$2&$A17&\" bis\"),Outils!$F:$V,D$6,FALSE),\"\")","v":""},{"$f":"IF($A19<>\"\",VLOOKUP(CONCATENATE($M$2&$A17&\" bis\"),Outils!$F:$V,E$6,FALSE),\"\")","v":""},{"$f":"IF($A19<>\"\",VLOOKUP(CONCATENATE($M$2&$A17&\" bis\"),Outils!$F:$V,F$6,FALSE),\"\")","v":""},{"$f":"IF($A19<>\"\",VLOOKUP(CONCATENATE($M$2&$A17&\" bis\"),Outils!$F:$V,G$6,FALSE),\"\")","v":""},{"$f":"IF($A19<>\"\",VLOOKUP(CONCATENATE($M$2&$A17&\" bis\"),Outils!$F:$V,H$6,FALSE),\"\")","v":""},{"$f":"IF($A19<>\"\",VLOOKUP(CONCATENATE($M$2&$A17&\" bis\"),Outils!$F:$V,I$6,FALSE),\"\")","v":""},{"$f":"IF($A19<>\"\",VLOOKUP(CONCATENATE($M$2&$A17&\" bis\"),Outils!$F:$V,J$6,FALSE),\"\")","v":""},{"$f":"IF($A19<>\"\",VLOOKUP(CONCATENATE($M$2&$A17&\" bis\"),Outils!$F:$V,K$6,FALSE),\"\")","v":""},{"$f":"IF($A19<>\"\",VLOOKUP(CONCATENATE($M$2&$A17&\" bis\"),Outils!$F:$V,L$6,FALSE),\"\")","v":""},{"$f":"IF($A19<>\"\",VLOOKUP(CONCATENATE($M$2&$A17&\" bis\"),Outils!$F:$V,M$6,FALSE),\"\")","v":""},{"$f":"IF($A19<>\"\",VLOOKUP(CONCATENATE($M$2&$A17&\" bis\"),Outils!$F:$V,N$6,FALSE),\"\")","v":""},{"$f":"IF($A19<>\"\",VLOOKUP(CONCATENATE($M$2&$A17&\" bis\"),Outils!$F:$V,O$6,FALSE),\"\")","v":""}]
["Dessert"]
[{"$f":"IF(ISNA(VLOOKUP(CONCATENATE($M$2&A20),Outils!$F:$S,2,FALSE)),\"\",VLOOKUP(CONCATENATE($M$2&A20),Outils!$F:$S,2,FALSE))","v":"Compote pomme"},{"$f":"IF($A21<>\"\",VLOOKUP(CONCATENATE($M$2&$A20),Outils!$F:$V,B$6,FALSE),\"\")","v":""},{"$f":"IF($A21<>\"\",VLOOKUP(CONCATENATE($M$2&$A20),Outils!$F:$V,C$6,FALSE),\"\")","v":""},{"$f":"IF($A21<>\"\",VLOOKUP(CONCATENATE($M$2&$A20),Outils!$F:$V,D$6,FALSE),\"\")","v":""},{"$f":"IF($A21<>\"\",VLOOKUP(CONCATENATE($M$2&$A20),Outils!$F:$V,E$6,FALSE),\"\")","v":""},{"$f":"IF($A21<>\"\",VLOOKUP(CONCATENATE($M$2&$A20),Outils!$F:$V,F$6,FALSE),\"\")","v":""},{"$f":"IF($A21<>\"\",VLOOKUP(CONCATENATE($M$2&$A20),Outils!$F:$V,G$6,FALSE),\"\")","v":""},{"$f":"IF($A21<>\"\",VLOOKUP(CONCATENATE($M$2&$A20),Outils!$F:$V,H$6,FALSE),\"\")","v":""},{"$f":"IF($A21<>\"\",VLOOKUP(CONCATENATE($M$2&$A20),Outils!$F:$V,I$6,FALSE),\"\")","v":""},{"$f":"IF($A21<>\"\",VLOOKUP(CONCATENATE($M$2&$A20),Outils!$F:$V,J$6,FALSE),\"\")","v":""},{"$f":"IF($A21<>\"\",VLOOKUP(CONCATENATE($M$2&$A20),Outils!$F:$V,K$6,FALSE),\"\")","v":""},{"$f":"IF($A21<>\"\",VLOOKUP(CONCATENATE($M$2&$A20),Outils!$F:$V,L$6,FALSE),\"\")","v":""},{"$f":"IF($A21<>\"\",VLOOKUP(CONCATENATE($M$2&$A20),Outils!$F:$V,M$6,FALSE),\"\")","v":""},{"$f":"IF($A21<>\"\",VLOOKUP(CONCATENATE($M$2&$A20),Outils!$F:$V,N$6,FALSE),\"\")","v":""},{"$f":"IF($A21<>\"\",VLOOKUP(CONCATENATE($M$2&$A20),Outils!$F:$V,O$6,FALSE),\"\")","v":""}]
[{"$f":"IF(ISNA(VLOOKUP(CONCATENATE($M$2&A20&\" bis\"),Outils!$F:$S,2,FALSE)),\"\",VLOOKUP(CONCATENATE($M$2&A20&\" bis\"),Outils!$F:$S,2,FALSE))","v":""},{"$f":"IF($A22<>\"\",VLOOKUP(CONCATENATE($M$2&$A20&\" bis\"),Outils!$F:$V,B$6,FALSE),\"\")","v":""},{"$f":"IF($A22<>\"\",VLOOKUP(CONCATENATE($M$2&$A20&\" bis\"),Outils!$F:$V,C$6,FALSE),\"\")","v":""},{"$f":"IF($A22<>\"\",VLOOKUP(CONCATENATE($M$2&$A20&\" bis\"),Outils!$F:$V,D$6,FALSE),\"\")","v":""},{"$f":"IF($A22<>\"\",VLOOKUP(CONCATENATE($M$2&$A20&\" bis\"),Outils!$F:$V,E$6,FALSE),\"\")","v":""},{"$f":"IF($A22<>\"\",VLOOKUP(CONCATENATE($M$2&$A20&\" bis\"),Outils!$F:$V,F$6,FALSE),\"\")","v":""},{"$f":"IF($A22<>\"\",VLOOKUP(CONCATENATE($M$2&$A20&\" bis\"),Outils!$F:$V,G$6,FALSE),\"\")","v":""},{"$f":"IF($A22<>\"\",VLOOKUP(CONCATENATE($M$2&$A20&\" bis\"),Outils!$F:$V,H$6,FALSE),\"\")","v":""},{"$f":"IF($A22<>\"\",VLOOKUP(CONCATENATE($M$2&$A20&\" bis\"),Outils!$F:$V,I$6,FALSE),\"\")","v":""},{"$f":"IF($A22<>\"\",VLOOKUP(CONCATENATE($M$2&$A20&\" bis\"),Outils!$F:$V,J$6,FALSE),\"\")","v":""},{"$f":"IF($A22<>\"\",VLOOKUP(CONCATENATE($M$2&$A20&\" bis\"),Outils!$F:$V,K$6,FALSE),\"\")","v":""},{"$f":"IF($A22<>\"\",VLOOKUP(CONCATENATE($M$2&$A20&\" bis\"),Outils!$F:$V,L$6,FALSE),\"\")","v":""},{"$f":"IF($A22<>\"\",VLOOKUP(CONCATENATE($M$2&$A20&\" bis\"),Outils!$F:$V,M$6,FALSE),\"\")","v":""},{"$f":"IF($A22<>\"\",VLOOKUP(CONCATENATE($M$2&$A20&\" bis\"),Outils!$F:$V,N$6,FALSE),\"\")","v":""},{"$f":"IF($A22<>\"\",VLOOKUP(CONCATENATE($M$2&$A20&\" bis\"),Outils!$F:$V,O$6,FALSE),\"\")","v":""}]
["Alternative sans porc"]
[{"$f":"IF(ISNA(VLOOKUP(CONCATENATE($M$2&A23),Outils!$F:$S,2,FALSE)),\"\",VLOOKUP(CONCATENATE($M$2&A23),Outils!$F:$S,2,FALSE))","v":""},{"$f":"IF($A24<>\"\",VLOOKUP(CONCATENATE($M$2&$A23),Outils!$F:$V,B$6,FALSE),\"\")","v":""},{"$f":"IF($A24<>\"\",VLOOKUP(CONCATENATE($M$2&$A23),Outils!$F:$V,C$6,FALSE),\"\")","v":""},{"$f":"IF($A24<>\"\",VLOOKUP(CONCATENATE($M$2&$A23),Outils!$F:$V,D$6,FALSE),\"\")","v":""},{"$f":"IF($A24<>\"\",VLOOKUP(CONCATENATE($M$2&$A23),Outils!$F:$V,E$6,FALSE),\"\")","v":""},{"$f":"IF($A24<>\"\",VLOOKUP(CONCATENATE($M$2&$A23),Outils!$F:$V,F$6,FALSE),\"\")","v":""},{"$f":"IF($A24<>\"\",VLOOKUP(CONCATENATE($M$2&$A23),Outils!$F:$V,G$6,FALSE),\"\")","v":""},{"$f":"IF($A24<>\"\",VLOOKUP(CONCATENATE($M$2&$A23),Outils!$F:$V,H$6,FALSE),\"\")","v":""},{"$f":"IF($A24<>\"\",VLOOKUP(CONCATENATE($M$2&$A23),Outils!$F:$V,I$6,FALSE),\"\")","v":""},{"$f":"IF($A24<>\"\",VLOOKUP(CONCATENATE($M$2&$A23),Outils!$F:$V,J$6,FALSE),\"\")","v":""},{"$f":"IF($A24<>\"\",VLOOKUP(CONCATENATE($M$2&$A23),Outils!$F:$V,K$6,FALSE),\"\")","v":""},{"$f":"IF($A24<>\"\",VLOOKUP(CONCATENATE($M$2&$A23),Outils!$F:$V,L$6,FALSE),\"\")","v":""},{"$f":"IF($A24<>\"\",VLOOKUP(CONCATENATE($M$2&$A23),Outils!$F:$V,M$6,FALSE),\"\")","v":""},{"$f":"IF($A24<>\"\",VLOOKUP(CONCATENATE($M$2&$A23),Outils!$F:$V,N$6,FALSE),\"\")","v":""},{"$f":"IF($A24<>\"\",VLOOKUP(CONCATENATE($M$2&$A23),Outils!$F:$V,O$6,FALSE),\"\")","v":""}]
["Alternative végétarien"]
[{"$f":"IF(ISNA(VLOOKUP(CONCATENATE($M$2&A25),Outils!$F:$S,2,FALSE)),\"\",VLOOKUP(CONCATENATE($M$2&A25),Outils!$F:$S,2,FALSE))","v":"Boulette de lentilles en sauce"},{"$f":"IF($A26<>\"\",VLOOKUP(CONCATENATE($M$2&$A25),Outils!$F:$V,B$6,FALSE),\"\")","v":"x"},{"$f":"IF($A26<>\"\",VLOOKUP(CONCATENATE($M$2&$A25),Outils!$F:$V,C$6,FALSE),\"\")","v":""},{"$f":"IF($A26<>\"\",VLOOKUP(CONCATENATE($M$2&$A25),Outils!$F:$V,D$6,FALSE),\"\")","v":"x"},{"$f":"IF($A26<>\"\",VLOOKUP(CONCATENATE($M$2&$A25),Outils!$F:$V,E$6,FALSE),\"\")","v":""},{"$f":"IF($A26<>\"\",VLOOKUP(CONCATENATE($M$2&$A25),Outils!$F:$V,F$6,FALSE),\"\")","v":""},{"$f":"IF($A26<>\"\",VLOOKUP(CONCATENATE($M$2&$A25),Outils!$F:$V,G$6,FALSE),\"\")","v":"x"},{"$f":"IF($A26<>\"\",VLOOKUP(CONCATENATE($M$2&$A25),Outils!$F:$V,H$6,FALSE),\"\")","v":"x"},{"$f":"IF($A26<>\"\",VLOOKUP(CONCATENATE($M$2&$A25),Outils!$F:$V,I$6,FALSE),\"\")","v":""},{"$f":"IF($A26<>\"\",VLOOKUP(CONCATENATE($M$2&$A25),Outils!$F:$V,J$6,FALSE),\"\")","v":"x"},{"$f":"IF($A26<>\"\",VLOOKUP(CONCATENATE($M$2&$A25),Outils!$F:$V,K$6,FALSE),\"\")","v":""},{"$f":"IF($A26<>\"\",VLOOKUP(CONCATENATE($M$2&$A25),Outils!$F:$V,L$6,FALSE),\"\")","v":""},{"$f":"IF($A26<>\"\",VLOOKUP(CONCATENATE($M$2&$A25),Outils!$F:$V,M$6,FALSE),\"\")","v":""},{"$f":"IF($A26<>\"\",VLOOKUP(CONCATENATE($M$2&$A25),Outils!$F:$V,N$6,FALSE),\"\")","v":""},{"$f":"IF($A26<>\"\",VLOOKUP(CONCATENATE($M$2&$A25),Outils!$F:$V,O$6,FALSE),\"\")","v":""}]