{"text_format":"1","workbook":"xlsx","n_sheets":3,"sheets":["MENUS","Outils","Allergènes du jour"],"not_rendered":{"charts":0,"images":15,"macros":1,"external_links":0,"defined_names":3,"comments":0,"pivot_tables":0},"unopened":[],"bounds":{"document_bytes":16777216,"sheet_cells":100000,"rows_first":2000,"rows_last":500,"rows_between":2000,"halvings":0,"cell_chars":16384,"cell_head_chars":4096},"cells_cut":0,"cells_raw":0,"read":"whole","date_system":"1900"}

{"sheet":"MENUS","index":0,"n_rows":60,"n_cols":10,"rows_kept":60,"cut":false,"hidden":false,"merged":[[2,7,2,8],[0,0,0,8],[1,0,1,8]]}
["Menus "]
["Mai Juin 2023"]
["2023-05-08"]
["JOUR","SEMAINE 19","SEMAINE 20","SEMAINE 21","SEMAINE 22","SEMAINE 23","SEMAINE 24","SEMAINE 25","SEMAINE 26","SEMAINE 27"]
["SEMAINE","DU 8 AU 12 MAI 2023","DU 15 AU 19 MAI 2023","DU 22 AU 26 MAI 2023","DU 29 MAI AU 2 JUIN 2023","DU 5 AU 9 JUIN 2023","DU 12 AU 16 JUIN 2023","DU 19 AU 23 JUIN 2023","DU 26 AU 30 JUIN 2023","DU 3 AU 7 JUILLET 2023"]
[null,null,null,"REPAS VEGETARIEN",null,"REPAS VEGETARIEN",null,null,null,"REPAS VEGETARIEN"]
[null,null,"","Salade de céleri BIO persillée",null,"Salade de boulgour","Salade californienne (Haricots rouges, maïs, poivrons, ananas)","","","Salade de carottes BIO"]
[]
[null,null,"Palette au jus","Falafels végétales au jus",null,"Omelette BIO aux fines herbes","Filet de lieu sauce blanche","Filet de porc sauce dijonnaise","Emincé de volaille sauce tomate","Crispy d'or au fromage"]
["LUNDI",null,"Lentilles aux dés de carottes","Semoule et ratatouille",null,"Gratin de chou-fleur","Riz et haricots verts","Pommes de terre sautées","Penne","Purée pommes de terre courgettes"]
[null,null,"Saint Paulin BIO","",null,"","","Brie BIO à la coupe","Fromage blanc sucré",""]
[]
[null,null,"Yaourt aux fruits","Fruit de saison",null,"Crème dessert chocolat","Fruit de saison BIO","Clafoutis à la cerise","Fruit de saison BIO","Fruit de saison"]
[]
[null,null,"Rôti de volaille au jus",null,null,null,null,"Filet de volaille sauce dijonnaise"]
[null,null,"Dhal de lentilles aux carottes et boulgour",null,null,null,"Palets de légumes montagnards, sauce blanche","Palet végétal sauce dijonnaise","Emincé végétal, sauce tomate"]
[null,null,"REPAS STREET FOOD",null,"REPAS VEGETARIEN",null,"REPAS VEGETARIEN",null,null,"MENU DES ENFANTS"]
[null,"Salade de chou rouge","","Salade de radis BIO","","","Salade verte","Crudités","Salade de riz composée"]
[]
[null,"Cassolette de colin d'Alaska","Emincé de poulet grillé aux épices, sauce blanche","Nuggets de poisson sauce tartare","Galette végétale légumes et mozzarella","Cassolette de poisson basquaise","Tortellinis tomates mozarella BIO sauce basilic","Sauté de bœuf sauce charcutière","Steack haché sauce brune"]
["MARDI","Riz BIO","Pomme de terre","Petits pois carottes","Courgettes BIO sauce tomate","Riz BIO",null,"Haricots plats et boulgour","Printannière de légumes"]
[null,"","Emmental à la coupe","","Cantadou","Coulommiers à la coupe","","",""]
[]
[null,"Compote pomme","Yaourt nature sucré bio","Yaourt aromatisé","Fondant au chocolat","Fruit de saison","Fruit de saison","Fruit de saison BIO","Compote de fruits BIO"]
[]
[]
[null,"Boulette de lentilles en sauce","Emincé végétal, sauce blanche","Nuggets végétariennes sauce tartare",null,"Quennelles basquaise",null,"Œufs brouillés aux herbes","Crêpe aux champignons"]
[null,null,"REPAS VEGETARIEN"]
[null,"","","","","Salade de radis","","Salade de carottes BIO","","Salade de tomates"]
[]
{"$rows_left_out":31}
{"sheet":"Outils","index":1,"n_rows":770,"n_cols":26,"rows_kept":770,"cut":false,"hidden":false,"merged":[]}
["2023-05-08","DU 8 AU 12 MAI 2023","LUNDI",null,"Thème","45054Thème","","","","","","","","","","","","","","","","","","","",""]
["2023-05-08","DU 8 AU 12 MAI 2023","LUNDI",null,"Entrée","45054Entrée","","","","","","","","","","","","","","","","","","","",""]
["2023-05-08","DU 8 AU 12 MAI 2023","LUNDI",null,"Entrée bis","45054Entrée bis","","","","","","","","","","","","","","","","","","","",""]
["2023-05-08","DU 8 AU 12 MAI 2023","LUNDI",null,"Plat","45054Plat","","","","","","","","","","","","","","","","","","","",""]
["2023-05-08","DU 8 AU 12 MAI 2023","LUNDI",null,"Garniture","45054Garniture","","","","","","","","","","","","","","","","","","","",""]
["2023-05-08","DU 8 AU 12 MAI 2023","LUNDI",null,"Fromage ou laitage","45054Fromage ou laitage","","","","","","","","","","","","","","","","","","","",""]
["2023-05-08","DU 8 AU 12 MAI 2023","LUNDI",null,"Fromage ou laitage bis","45054Fromage ou laitage bis","","","","","","","","","","","","","","","","","","","",""]
["2023-05-08","DU 8 AU 12 MAI 2023","LUNDI",null,"Dessert","45054Dessert","","","","","","","","","","","","","","","","","","","",""]
["2023-05-08","DU 8 AU 12 MAI 2023","LUNDI",null,"Dessert bis","45054Dessert bis","","","","","","","","","","","","","","","","","","","",""]
["2023-05-08","DU 8 AU 12 MAI 2023","LUNDI",null,"Alternative sans porc","45054Alternative sans porc","","","","","","","","","","","","","","","","","","","",""]
["2023-05-08","DU 8 AU 12 MAI 2023","LUNDI",null,"Alternative végétarien","45054Alternative végétarien","","","","","","","","","","","","","","","","","","","",""]
["2023-05-09","DU 8 AU 12 MAI 2023","MARDI",null,"Thème","45055Thème","","","","","","","","","","","","","","","","","","","",""]
["2023-05-09","DU 8 AU 12 MAI 2023","MARDI","Salade de chou rouge","Entrée","45055Entrée","Salade de chou rouge","OK","","","","","","","","","x","x","","x","","","Scolaires","Entrée","Crudité",""]
["2023-05-09","DU 8 AU 12 MAI 2023","MARDI",null,"Entrée bis","45055Entrée bis","","","","","","","","","","","","","","","","","","","",""]
["2023-05-09","DU 8 AU 12 MAI 2023","MARDI","Cassolette de colin d'Alaska","Plat","45055Plat","Cassolette de colin d'Alaska","OK","x","x","x","x","","x","x","","x","","","","","x","Scolaires","Plat","Poisson",""]
["2023-05-09","DU 8 AU 12 MAI 2023","MARDI","Riz BIO","Garniture","45055Garniture","Riz BIO","OK","","","","","","","","","","","","","","","Scolaires","Garniture BIO","Féculents",""]
["2023-05-09","DU 8 AU 12 MAI 2023","MARDI","","Fromage ou laitage","45055Fromage ou laitage","","","","","","","","","","","","","","","","","","","",""]
["2023-05-09","DU 8 AU 12 MAI 2023","MARDI",null,"Fromage ou laitage bis","45055Fromage ou laitage bis","","","","","","","","","","","","","","","","","","","",""]
["2023-05-09","DU 8 AU 12 MAI 2023","MARDI","Compote pomme","Dessert","45055Dessert","Compote pomme","OK","","","","","","","","","","","","","","","Scolaires","Dessert","Fruit cru ou cuit",""]
["2023-05-09","DU 8 AU 12 MAI 2023","MARDI",null,"Dessert bis","45055Dessert bis","","","","","","","","","","","","","","","","","","","",""]
["2023-05-09","DU 8 AU 12 MAI 2023","MARDI",null,"Alternative sans porc","45055Alternative sans porc","","","","","","","","","","","","","","","","","","","",""]
["2023-05-09","DU 8 AU 12 MAI 2023","MARDI","Boulette de lentilles en sauce","Alternative végétarien","45055Alternative végétarien","Boulette de lentilles en sauce","OK","x","","x","","","x","x","","x","","","","","","Scolaires","Plat","Végétarien",""]
["2023-05-10","DU 8 AU 12 MAI 2023","MERCREDI",null,"Thème","45056Thème","","","","","","","","","","","","","","","","","","","",""]
["2023-05-10","DU 8 AU 12 MAI 2023","MERCREDI","","Entrée","45056Entrée","","","","","","","","","","","","","","","","","","","",""]
["2023-05-10","DU 8 AU 12 MAI 2023","MERCREDI",null,"Entrée bis","45056Entrée bis","","","","","","","","","","","","","","","","","","","",""]
["2023-05-10","DU 8 AU 12 MAI 2023","MERCREDI","Cordon bleu de volaille ketchup","Plat","45056Plat","Cordon bleu de volaille ketchup","OK","x","","","","","x","x","","","","","","","","Scolaires","Plat","Volaille",""]
["2023-05-10","DU 8 AU 12 MAI 2023","MERCREDI","Pommes rissolées","Garniture","45056Garniture","Pommes rissolées","OK","","","","","","","","","","","","","","","Scolaires","Garniture","Féculents",""]
["2023-05-10","DU 8 AU 12 MAI 2023","MERCREDI","Camembert à la coupe BIO","Fromage ou laitage","45056Fromage ou laitage","Camembert à la coupe BIO","OK","","","","","","","x","","","","","","","","Scolaires","Produits laitiers BIO","Fromage",""]
["2023-05-10","DU 8 AU 12 MAI 2023","MERCREDI",null,"Fromage ou laitage bis","45056Fromage ou laitage bis","","","","","","","","","","","","","","","","","","","",""]
["2023-05-10","DU 8 AU 12 MAI 2023","MERCREDI","Yaourt aux fruits","Dessert","45056Dessert","Yaourt aux fruits","OK","","","","","","","x","","","","","","","","Scolaires","Produits laitiers","Laitage",""]
{"$rows_left_out":741}
{"sheet":"Allergènes du jour","index":2,"n_rows":26,"n_cols":15,"rows_kept":26,"cut":false,"hidden":false,"merged":[[6,13,8,13],[6,14,8,14],[1,9,1,11],[1,12,1,14],[1,0,1,2],[4,0,6,0],[0,0,0,14],[6,1,8,1],[6,2,8,2],[6,3,8,3],[6,4,8,4],[6,5,8,5],[6,6,8,6],[6,7,8,7],[6,8,8,8],[6,9,8,9],[6,10,8,10],[6,11,8,11],[6,12,8,12]]}
["FICHE DE SUIVI DES ALLERGENES*"]
["Client : WOLFISHEIM",null,null,null,null,null,"MENU SANS CHOIX",null,null,"DATE DE CONSOMMATION :",null,null,"2023-05-09"]
[]
["* L'information ne fait pas état des éventuelles contaminations croisées pouvant survenir au moment de la préparation des repas ou ensuite au moment du service."]
[]
[null,4,5,6,7,8,9,10,11,12,13,14,15,16,17]
[null,"Céréales contenant du gluten","Crustacés et produits    à base de crustacés","Oeufs          et produits à base d'oeufs","Poissons     et produits à base de poissons","Arachide            et produits à base d'arachide","Soja et produits à base de soja","Lait  et produits à base de lait (y compris le lactose)","Fruits à coque et produits à base de ces fruits","Céleri et produits à base de céleri","Moutarde           et produits à base de moutarde","Graines de sésame        et produits à base de graines de sésame","Anhydride sulfureux         et       sulfites","Lupin           et produits à base de lupin","Mollusques et produits à base de mollusques"]
["Thème"]
[{"$f":"IF(ISNA(VLOOKUP(CONCATENATE($M$2&A8),Outils!$F:$S,2,FALSE)),\"\",VLOOKUP(CONCATENATE($M$2&A8),Outils!$F:$S,2,FALSE))","v":""}]
["Entrée"]
[{"$f":"IF(ISNA(VLOOKUP(CONCATENATE($M$2&A10),Outils!$F:$S,2,FALSE)),\"\",VLOOKUP(CONCATENATE($M$2&A10),Outils!$F:$S,2,FALSE))","v":"Salade de chou rouge"},{"$f":"IF($A11<>\"\",VLOOKUP(CONCATENATE($M$2&$A10),Outils!$F:$V,B$6,FALSE),\"\")","v":""},{"$f":"IF($A11<>\"\",VLOOKUP(CONCATENATE($M$2&$A10),Outils!$F:$V,C$6,FALSE),\"\")","v":""},{"$f":"IF($A11<>\"\",VLOOKUP(CONCATENATE($M$2&$A10),Outils!$F:$V,D$6,FALSE),\"\")","v":""},{"$f":"IF($A11<>\"\",VLOOKUP(CONCATENATE($M$2&$A10),Outils!$F:$V,E$6,FALSE),\"\")","v":""},{"$f":"IF($A11<>\"\",VLOOKUP(CONCATENATE($M$2&$A10),Outils!$F:$V,F$6,FALSE),\"\")","v":""},{"$f":"IF($A11<>\"\",VLOOKUP(CONCATENATE($M$2&$A10),Outils!$F:$V,G$6,FALSE),\"\")","v":""},{"$f":"IF($A11<>\"\",VLOOKUP(CONCATENATE($M$2&$A10),Outils!$F:$V,H$6,FALSE),\"\")","v":""},{"$f":"IF($A11<>\"\",VLOOKUP(CONCATENATE($M$2&$A10),Outils!$F:$V,I$6,FALSE),\"\")","v":""},{"$f":"IF($A11<>\"\",VLOOKUP(CONCATENATE($M$2&$A10),Outils!$F:$V,J$6,FALSE),\"\")","v":"x"},{"$f":"IF($A11<>\"\",VLOOKUP(CONCATENATE($M$2&$A10),Outils!$F:$V,K$6,FALSE),\"\")","v":"x"},{"$f":"IF($A11<>\"\",VLOOKUP(CONCATENATE($M$2&$A10),Outils!$F:$V,L$6,FALSE),\"\")","v":""},{"$f":"IF($A11<>\"\",VLOOKUP(CONCATENATE($M$2&$A10),Outils!$F:$V,M$6,FALSE),\"\")","v":"x"},{"$f":"IF($A11<>\"\",VLOOKUP(CONCATENATE($M$2&$A10),Outils!$F:$V,N$6,FALSE),\"\")","v":""},{"$f":"IF($A11<>\"\",VLOOKUP(CONCATENATE($M$2&$A10),Outils!$F:$V,O$6,FALSE),\"\")","v":""}]
[{"$f":"IF(ISNA(VLOOKUP(CONCATENATE($M$2&A10&\" bis\"),Outils!$F:$S,2,FALSE)),\"\",VLOOKUP(CONCATENATE($M$2&A10&\" bis\"),Outils!$F:$S,2,FALSE))","v":""},{"$f":"IF($A12<>\"\",VLOOKUP(CONCATENATE($M$2&$A10&\" bis\"),Outils!$F:$V,B$6,FALSE),\"\")","v":""},{"$f":"IF($A12<>\"\",VLOOKUP(CONCATENATE($M$2&$A10&\" bis\"),Outils!$F:$V,C$6,FALSE),\"\")","v":""},{"$f":"IF($A12<>\"\",VLOOKUP(CONCATENATE($M$2&$A10&\" bis\"),Outils!$F:$V,D$6,FALSE),\"\")","v":""},{"$f":"IF($A12<>\"\",VLOOKUP(CONCATENATE($M$2&$A10&\" bis\"),Outils!$F:$V,E$6,FALSE),\"\")","v":""},{"$f":"IF($A12<>\"\",VLOOKUP(CONCATENATE($M$2&$A10&\" bis\"),Outils!$F:$V,F$6,FALSE),\"\")","v":""},{"$f":"IF($A12<>\"\",VLOOKUP(CONCATENATE($M$2&$A10&\" bis\"),Outils!$F:$V,G$6,FALSE),\"\")","v":""},{"$f":"IF($A12<>\"\",VLOOKUP(CONCATENATE($M$2&$A10&\" bis\"),Outils!$F:$V,H$6,FALSE),\"\")","v":""},{"$f":"IF($A12<>\"\",VLOOKUP(CONCATENATE($M$2&$A10&\" bis\"),Outils!$F:$V,I$6,FALSE),\"\")","v":""},{"$f":"IF($A12<>\"\",VLOOKUP(CONCATENATE($M$2&$A10&\" bis\"),Outils!$F:$V,J$6,FALSE),\"\")","v":""},{"$f":"IF($A12<>\"\",VLOOKUP(CONCATENATE($M$2&$A10&\" bis\"),Outils!$F:$V,K$6,FALSE),\"\")","v":""},{"$f":"IF($A12<>\"\",VLOOKUP(CONCATENATE($M$2&$A10&\" bis\"),Outils!$F:$V,L$6,FALSE),\"\")","v":""},{"$f":"IF($A12<>\"\",VLOOKUP(CONCATENATE($M$2&$A10&\" bis\"),Outils!$F:$V,M$6,FALSE),\"\")","v":""},{"$f":"IF($A12<>\"\",VLOOKUP(CONCATENATE($M$2&$A10&\" bis\"),Outils!$F:$V,N$6,FALSE),\"\")","v":""},{"$f":"IF($A12<>\"\",VLOOKUP(CONCATENATE($M$2&$A10&\" bis\"),Outils!$F:$V,O$6,FALSE),\"\")","v":""}]
["Plat"]
[{"$f":"IF(ISNA(VLOOKUP(CONCATENATE($M$2&A13),Outils!$F:$S,2,FALSE)),\"\",VLOOKUP(CONCATENATE($M$2&A13),Outils!$F:$S,2,FALSE))","v":"Cassolette de colin d'Alaska"},{"$f":"IF($A14<>\"\",VLOOKUP(CONCATENATE($M$2&$A13),Outils!$F:$V,B$6,FALSE),\"\")","v":"x"},{"$f":"IF($A14<>\"\",VLOOKUP(CONCATENATE($M$2&$A13),Outils!$F:$V,C$6,FALSE),\"\")","v":"x"},{"$f":"IF($A14<>\"\",VLOOKUP(CONCATENATE($M$2&$A13),Outils!$F:$V,D$6,FALSE),\"\")","v":"x"},{"$f":"IF($A14<>\"\",VLOOKUP(CONCATENATE($M$2&$A13),Outils!$F:$V,E$6,FALSE),\"\")","v":"x"},{"$f":"IF($A14<>\"\",VLOOKUP(CONCATENATE($M$2&$A13),Outils!$F:$V,F$6,FALSE),\"\")","v":""},{"$f":"IF($A14<>\"\",VLOOKUP(CONCATENATE($M$2&$A13),Outils!$F:$V,G$6,FALSE),\"\")","v":"x"},{"$f":"IF($A14<>\"\",VLOOKUP(CONCATENATE($M$2&$A13),Outils!$F:$V,H$6,FALSE),\"\")","v":"x"},{"$f":"IF($A14<>\"\",VLOOKUP(CONCATENATE($M$2&$A13),Outils!$F:$V,I$6,FALSE),\"\")","v":""},{"$f":"IF($A14<>\"\",VLOOKUP(CONCATENATE($M$2&$A13),Outils!$F:$V,J$6,FALSE),\"\")","v":"x"},{"$f":"IF($A14<>\"\",VLOOKUP(CONCATENATE($M$2&$A13),Outils!$F:$V,K$6,FALSE),\"\")","v":""},{"$f":"IF($A14<>\"\",VLOOKUP(CONCATENATE($M$2&$A13),Outils!$F:$V,L$6,FALSE),\"\")","v":""},{"$f":"IF($A14<>\"\",VLOOKUP(CONCATENATE($M$2&$A13),Outils!$F:$V,M$6,FALSE),\"\")","v":""},{"$f":"IF($A14<>\"\",VLOOKUP(CONCATENATE($M$2&$A13),Outils!$F:$V,N$6,FALSE),\"\")","v":""},{"$f":"IF($A14<>\"\",VLOOKUP(CONCATENATE($M$2&$A13),Outils!$F:$V,O$6,FALSE),\"\")","v":"x"}]
["Garniture"]
[{"$f":"IF(ISNA(VLOOKUP(CONCATENATE($M$2&A15),Outils!$F:$S,2,FALSE)),\"\",VLOOKUP(CONCATENATE($M$2&A15),Outils!$F:$S,2,FALSE))","v":"Riz BIO"},{"$f":"IF($A16<>\"\",VLOOKUP(CONCATENATE($M$2&$A15),Outils!$F:$V,B$6,FALSE),\"\")","v":""},{"$f":"IF($A16<>\"\",VLOOKUP(CONCATENATE($M$2&$A15),Outils!$F:$V,C$6,FALSE),\"\")","v":""},{"$f":"IF($A16<>\"\",VLOOKUP(CONCATENATE($M$2&$A15),Outils!$F:$V,D$6,FALSE),\"\")","v":""},{"$f":"IF($A16<>\"\",VLOOKUP(CONCATENATE($M$2&$A15),Outils!$F:$V,E$6,FALSE),\"\")","v":""},{"$f":"IF($A16<>\"\",VLOOKUP(CONCATENATE($M$2&$A15),Outils!$F:$V,F$6,FALSE),\"\")","v":""},{"$f":"IF($A16<>\"\",VLOOKUP(CONCATENATE($M$2&$A15),Outils!$F:$V,G$6,FALSE),\"\")","v":""},{"$f":"IF($A16<>\"\",VLOOKUP(CONCATENATE($M$2&$A15),Outils!$F:$V,H$6,FALSE),\"\")","v":""},{"$f":"IF($A16<>\"\",VLOOKUP(CONCATENATE($M$2&$A15),Outils!$F:$V,I$6,FALSE),\"\")","v":""},{"$f":"IF($A16<>\"\",VLOOKUP(CONCATENATE($M$2&$A15),Outils!$F:$V,J$6,FALSE),\"\")","v":""},{"$f":"IF($A16<>\"\",VLOOKUP(CONCATENATE($M$2&$A15),Outils!$F:$V,K$6,FALSE),\"\")","v":""},{"$f":"IF($A16<>\"\",VLOOKUP(CONCATENATE($M$2&$A15),Outils!$F:$V,L$6,FALSE),\"\")","v":""},{"$f":"IF($A16<>\"\",VLOOKUP(CONCATENATE($M$2&$A15),Outils!$F:$V,M$6,FALSE),\"\")","v":""},{"$f":"IF($A16<>\"\",VLOOKUP(CONCATENATE($M$2&$A15),Outils!$F:$V,N$6,FALSE),\"\")","v":""},{"$f":"IF($A16<>\"\",VLOOKUP(CONCATENATE($M$2&$A15),Outils!$F:$V,O$6,FALSE),\"\")","v":""}]
["Fromage ou laitage"]
[{"$f":"IF(ISNA(VLOOKUP(CONCATENATE($M$2&A17),Outils!$F:$S,2,FALSE)),\"\",VLOOKUP(CONCATENATE($M$2&A17),Outils!$F:$S,2,FALSE))","v":""},{"$f":"IF($A18<>\"\",VLOOKUP(CONCATENATE($M$2&$A17),Outils!$F:$V,B$6,FALSE),\"\")","v":""},{"$f":"IF($A18<>\"\",VLOOKUP(CONCATENATE($M$2&$A17),Outils!$F:$V,C$6,FALSE),\"\")","v":""},{"$f":"IF($A18<>\"\",VLOOKUP(CONCATENATE($M$2&$A17),Outils!$F:$V,D$6,FALSE),\"\")","v":""},{"$f":"IF($A18<>\"\",VLOOKUP(CONCATENATE($M$2&$A17),Outils!$F:$V,E$6,FALSE),\"\")","v":""},{"$f":"IF($A18<>\"\",VLOOKUP(CONCATENATE($M$2&$A17),Outils!$F:$V,F$6,FALSE),\"\")","v":""},{"$f":"IF($A18<>\"\",VLOOKUP(CONCATENATE($M$2&$A17),Outils!$F:$V,G$6,FALSE),\"\")","v":""},{"$f":"IF($A18<>\"\",VLOOKUP(CONCATENATE($M$2&$A17),Outils!$F:$V,H$6,FALSE),\"\")","v":""},{"$f":"IF($A18<>\"\",VLOOKUP(CONCATENATE($M$2&$A17),Outils!$F:$V,I$6,FALSE),\"\")","v":""},{"$f":"IF($A18<>\"\",VLOOKUP(CONCATENATE($M$2&$A17),Outils!$F:$V,J$6,FALSE),\"\")","v":""},{"$f":"IF($A18<>\"\",VLOOKUP(CONCATENATE($M$2&$A17),Outils!$F:$V,K$6,FALSE),\"\")","v":""},{"$f":"IF($A18<>\"\",VLOOKUP(CONCATENATE($M$2&$A17),Outils!$F:$V,L$6,FALSE),\"\")","v":""},{"$f":"IF($A18<>\"\",VLOOKUP(CONCATENATE($M$2&$A17),Outils!$F:$V,M$6,FALSE),\"\")","v":""},{"$f":"IF($A18<>\"\",VLOOKUP(CONCATENATE($M$2&$A17),Outils!$F:$V,N$6,FALSE),\"\")","v":""},{"$f":"IF($A18<>\"\",VLOOKUP(CONCATENATE($M$2&$A17),Outils!$F:$V,O$6,FALSE),\"\")","v":""}]
[{"$f":"IF(ISNA(VLOOKUP(CONCATENATE($M$2&A17&\" bis\"),Outils!$F:$S,2,FALSE)),\"\",VLOOKUP(CONCATENATE($M$2&A17&\" bis\"),Outils!$F:$S,2,FALSE))","v":""},{"$f":"IF($A19<>\"\",VLOOKUP(CONCATENATE($M$2&$A17&\" bis\"),Outils!$F:$V,B$6,FALSE),\"\")","v":""},{"$f":"IF($A19<>\"\",VLOOKUP(CONCATENATE($M$2&$A17&\" bis\"),Outils!$F:$V,C$6,FALSE),\"\")","v":""},{"$f":"IF($A19<>\"\",VLOOKUP(CONCATENATE($M$2&$A17&\" bis\"),Outils!$F:$V,D$6,FALSE),\"\")","v":""},{"$f":"IF($A19<>\"\",VLOOKUP(CONCATENATE($M$2&$A17&\" bis\"),Outils!$F:$V,E$6,FALSE),\"\")","v":""},{"$f":"IF($A19<>\"\",VLOOKUP(CONCATENATE($M$2&$A17&\" bis\"),Outils!$F:$V,F$6,FALSE),\"\")","v":""},{"$f":"IF($A19<>\"\",VLOOKUP(CONCATENATE($M$2&$A17&\" bis\"),Outils!$F:$V,G$6,FALSE),\"\")","v":""},{"$f":"IF($A19<>\"\",VLOOKUP(CONCATENATE($M$2&$A17&\" bis\"),Outils!$F:$V,H$6,FALSE),\"\")","v":""},{"$f":"IF($A19<>\"\",VLOOKUP(CONCATENATE($M$2&$A17&\" bis\"),Outils!$F:$V,I$6,FALSE),\"\")","v":""},{"$f":"IF($A19<>\"\",VLOOKUP(CONCATENATE($M$2&$A17&\" bis\"),Outils!$F:$V,J$6,FALSE),\"\")","v":""},{"$f":"IF($A19<>\"\",VLOOKUP(CONCATENATE($M$2&$A17&\" bis\"),Outils!$F:$V,K$6,FALSE),\"\")","v":""},{"$f":"IF($A19<>\"\",VLOOKUP(CONCATENATE($M$2&$A17&\" bis\"),Outils!$F:$V,L$6,FALSE),\"\")","v":""},{"$f":"IF($A19<>\"\",VLOOKUP(CONCATENATE($M$2&$A17&\" bis\"),Outils!$F:$V,M$6,FALSE),\"\")","v":""},{"$f":"IF($A19<>\"\",VLOOKUP(CONCATENATE($M$2&$A17&\" bis\"),Outils!$F:$V,N$6,FALSE),\"\")","v":""},{"$f":"IF($A19<>\"\",VLOOKUP(CONCATENATE($M$2&$A17&\" bis\"),Outils!$F:$V,O$6,FALSE),\"\")","v":""}]
["Dessert"]
[{"$f":"IF(ISNA(VLOOKUP(CONCATENATE($M$2&A20),Outils!$F:$S,2,FALSE)),\"\",VLOOKUP(CONCATENATE($M$2&A20),Outils!$F:$S,2,FALSE))","v":"Compote pomme"},{"$f":"IF($A21<>\"\",VLOOKUP(CONCATENATE($M$2&$A20),Outils!$F:$V,B$6,FALSE),\"\")","v":""},{"$f":"IF($A21<>\"\",VLOOKUP(CONCATENATE($M$2&$A20),Outils!$F:$V,C$6,FALSE),\"\")","v":""},{"$f":"IF($A21<>\"\",VLOOKUP(CONCATENATE($M$2&$A20),Outils!$F:$V,D$6,FALSE),\"\")","v":""},{"$f":"IF($A21<>\"\",VLOOKUP(CONCATENATE($M$2&$A20),Outils!$F:$V,E$6,FALSE),\"\")","v":""},{"$f":"IF($A21<>\"\",VLOOKUP(CONCATENATE($M$2&$A20),Outils!$F:$V,F$6,FALSE),\"\")","v":""},{"$f":"IF($A21<>\"\",VLOOKUP(CONCATENATE($M$2&$A20),Outils!$F:$V,G$6,FALSE),\"\")","v":""},{"$f":"IF($A21<>\"\",VLOOKUP(CONCATENATE($M$2&$A20),Outils!$F:$V,H$6,FALSE),\"\")","v":""},{"$f":"IF($A21<>\"\",VLOOKUP(CONCATENATE($M$2&$A20),Outils!$F:$V,I$6,FALSE),\"\")","v":""},{"$f":"IF($A21<>\"\",VLOOKUP(CONCATENATE($M$2&$A20),Outils!$F:$V,J$6,FALSE),\"\")","v":""},{"$f":"IF($A21<>\"\",VLOOKUP(CONCATENATE($M$2&$A20),Outils!$F:$V,K$6,FALSE),\"\")","v":""},{"$f":"IF($A21<>\"\",VLOOKUP(CONCATENATE($M$2&$A20),Outils!$F:$V,L$6,FALSE),\"\")","v":""},{"$f":"IF($A21<>\"\",VLOOKUP(CONCATENATE($M$2&$A20),Outils!$F:$V,M$6,FALSE),\"\")","v":""},{"$f":"IF($A21<>\"\",VLOOKUP(CONCATENATE($M$2&$A20),Outils!$F:$V,N$6,FALSE),\"\")","v":""},{"$f":"IF($A21<>\"\",VLOOKUP(CONCATENATE($M$2&$A20),Outils!$F:$V,O$6,FALSE),\"\")","v":""}]
[{"$f":"IF(ISNA(VLOOKUP(CONCATENATE($M$2&A20&\" bis\"),Outils!$F:$S,2,FALSE)),\"\",VLOOKUP(CONCATENATE($M$2&A20&\" bis\"),Outils!$F:$S,2,FALSE))","v":""},{"$f":"IF($A22<>\"\",VLOOKUP(CONCATENATE($M$2&$A20&\" bis\"),Outils!$F:$V,B$6,FALSE),\"\")","v":""},{"$f":"IF($A22<>\"\",VLOOKUP(CONCATENATE($M$2&$A20&\" bis\"),Outils!$F:$V,C$6,FALSE),\"\")","v":""},{"$f":"IF($A22<>\"\",VLOOKUP(CONCATENATE($M$2&$A20&\" bis\"),Outils!$F:$V,D$6,FALSE),\"\")","v":""},{"$f":"IF($A22<>\"\",VLOOKUP(CONCATENATE($M$2&$A20&\" bis\"),Outils!$F:$V,E$6,FALSE),\"\")","v":""},{"$f":"IF($A22<>\"\",VLOOKUP(CONCATENATE($M$2&$A20&\" bis\"),Outils!$F:$V,F$6,FALSE),\"\")","v":""},{"$f":"IF($A22<>\"\",VLOOKUP(CONCATENATE($M$2&$A20&\" bis\"),Outils!$F:$V,G$6,FALSE),\"\")","v":""},{"$f":"IF($A22<>\"\",VLOOKUP(CONCATENATE($M$2&$A20&\" bis\"),Outils!$F:$V,H$6,FALSE),\"\")","v":""},{"$f":"IF($A22<>\"\",VLOOKUP(CONCATENATE($M$2&$A20&\" bis\"),Outils!$F:$V,I$6,FALSE),\"\")","v":""},{"$f":"IF($A22<>\"\",VLOOKUP(CONCATENATE($M$2&$A20&\" bis\"),Outils!$F:$V,J$6,FALSE),\"\")","v":""},{"$f":"IF($A22<>\"\",VLOOKUP(CONCATENATE($M$2&$A20&\" bis\"),Outils!$F:$V,K$6,FALSE),\"\")","v":""},{"$f":"IF($A22<>\"\",VLOOKUP(CONCATENATE($M$2&$A20&\" bis\"),Outils!$F:$V,L$6,FALSE),\"\")","v":""},{"$f":"IF($A22<>\"\",VLOOKUP(CONCATENATE($M$2&$A20&\" bis\"),Outils!$F:$V,M$6,FALSE),\"\")","v":""},{"$f":"IF($A22<>\"\",VLOOKUP(CONCATENATE($M$2&$A20&\" bis\"),Outils!$F:$V,N$6,FALSE),\"\")","v":""},{"$f":"IF($A22<>\"\",VLOOKUP(CONCATENATE($M$2&$A20&\" bis\"),Outils!$F:$V,O$6,FALSE),\"\")","v":""}]
["Alternative sans porc"]
[{"$f":"IF(ISNA(VLOOKUP(CONCATENATE($M$2&A23),Outils!$F:$S,2,FALSE)),\"\",VLOOKUP(CONCATENATE($M$2&A23),Outils!$F:$S,2,FALSE))","v":""},{"$f":"IF($A24<>\"\",VLOOKUP(CONCATENATE($M$2&$A23),Outils!$F:$V,B$6,FALSE),\"\")","v":""},{"$f":"IF($A24<>\"\",VLOOKUP(CONCATENATE($M$2&$A23),Outils!$F:$V,C$6,FALSE),\"\")","v":""},{"$f":"IF($A24<>\"\",VLOOKUP(CONCATENATE($M$2&$A23),Outils!$F:$V,D$6,FALSE),\"\")","v":""},{"$f":"IF($A24<>\"\",VLOOKUP(CONCATENATE($M$2&$A23),Outils!$F:$V,E$6,FALSE),\"\")","v":""},{"$f":"IF($A24<>\"\",VLOOKUP(CONCATENATE($M$2&$A23),Outils!$F:$V,F$6,FALSE),\"\")","v":""},{"$f":"IF($A24<>\"\",VLOOKUP(CONCATENATE($M$2&$A23),Outils!$F:$V,G$6,FALSE),\"\")","v":""},{"$f":"IF($A24<>\"\",VLOOKUP(CONCATENATE($M$2&$A23),Outils!$F:$V,H$6,FALSE),\"\")","v":""},{"$f":"IF($A24<>\"\",VLOOKUP(CONCATENATE($M$2&$A23),Outils!$F:$V,I$6,FALSE),\"\")","v":""},{"$f":"IF($A24<>\"\",VLOOKUP(CONCATENATE($M$2&$A23),Outils!$F:$V,J$6,FALSE),\"\")","v":""},{"$f":"IF($A24<>\"\",VLOOKUP(CONCATENATE($M$2&$A23),Outils!$F:$V,K$6,FALSE),\"\")","v":""},{"$f":"IF($A24<>\"\",VLOOKUP(CONCATENATE($M$2&$A23),Outils!$F:$V,L$6,FALSE),\"\")","v":""},{"$f":"IF($A24<>\"\",VLOOKUP(CONCATENATE($M$2&$A23),Outils!$F:$V,M$6,FALSE),\"\")","v":""},{"$f":"IF($A24<>\"\",VLOOKUP(CONCATENATE($M$2&$A23),Outils!$F:$V,N$6,FALSE),\"\")","v":""},{"$f":"IF($A24<>\"\",VLOOKUP(CONCATENATE($M$2&$A23),Outils!$F:$V,O$6,FALSE),\"\")","v":""}]
["Alternative végétarien"]
[{"$f":"IF(ISNA(VLOOKUP(CONCATENATE($M$2&A25),Outils!$F:$S,2,FALSE)),\"\",VLOOKUP(CONCATENATE($M$2&A25),Outils!$F:$S,2,FALSE))","v":"Boulette de lentilles en sauce"},{"$f":"IF($A26<>\"\",VLOOKUP(CONCATENATE($M$2&$A25),Outils!$F:$V,B$6,FALSE),\"\")","v":"x"},{"$f":"IF($A26<>\"\",VLOOKUP(CONCATENATE($M$2&$A25),Outils!$F:$V,C$6,FALSE),\"\")","v":""},{"$f":"IF($A26<>\"\",VLOOKUP(CONCATENATE($M$2&$A25),Outils!$F:$V,D$6,FALSE),\"\")","v":"x"},{"$f":"IF($A26<>\"\",VLOOKUP(CONCATENATE($M$2&$A25),Outils!$F:$V,E$6,FALSE),\"\")","v":""},{"$f":"IF($A26<>\"\",VLOOKUP(CONCATENATE($M$2&$A25),Outils!$F:$V,F$6,FALSE),\"\")","v":""},{"$f":"IF($A26<>\"\",VLOOKUP(CONCATENATE($M$2&$A25),Outils!$F:$V,G$6,FALSE),\"\")","v":"x"},{"$f":"IF($A26<>\"\",VLOOKUP(CONCATENATE($M$2&$A25),Outils!$F:$V,H$6,FALSE),\"\")","v":"x"},{"$f":"IF($A26<>\"\",VLOOKUP(CONCATENATE($M$2&$A25),Outils!$F:$V,I$6,FALSE),\"\")","v":""},{"$f":"IF($A26<>\"\",VLOOKUP(CONCATENATE($M$2&$A25),Outils!$F:$V,J$6,FALSE),\"\")","v":"x"},{"$f":"IF($A26<>\"\",VLOOKUP(CONCATENATE($M$2&$A25),Outils!$F:$V,K$6,FALSE),\"\")","v":""},{"$f":"IF($A26<>\"\",VLOOKUP(CONCATENATE($M$2&$A25),Outils!$F:$V,L$6,FALSE),\"\")","v":""},{"$f":"IF($A26<>\"\",VLOOKUP(CONCATENATE($M$2&$A25),Outils!$F:$V,M$6,FALSE),\"\")","v":""},{"$f":"IF($A26<>\"\",VLOOKUP(CONCATENATE($M$2&$A25),Outils!$F:$V,N$6,FALSE),\"\")","v":""},{"$f":"IF($A26<>\"\",VLOOKUP(CONCATENATE($M$2&$A25),Outils!$F:$V,O$6,FALSE),\"\")","v":""}]